{"text_format":"1","workbook":"xlsx","n_sheets":2,"sheets":["Template","Moves"],"not_rendered":{"charts":0,"images":0,"macros":1,"external_links":0,"defined_names":26,"comments":0,"pivot_tables":0},"unopened":[],"bounds":{"document_bytes":16777216,"sheet_cells":100000,"rows_first":2000,"rows_last":500,"rows_between":2000,"halvings":0,"cell_chars":16384,"cell_head_chars":4096},"cells_cut":0,"cells_raw":0,"read":"whole","date_system":"1900"}

{"sheet":"Template","index":0,"n_rows":158,"n_cols":111,"rows_kept":158,"cut":false,"hidden":false,"merged":[[4,8,4,9],[4,0,4,1],[4,3,4,4],[5,0,5,1],[6,0,7,1],[6,3,6,5],[4,5,4,7],[6,62,6,69],[6,70,6,77],[6,78,6,85],[6,86,6,93],[18,3,18,5],[18,6,18,9],[6,14,6,21],[6,22,6,29],[6,30,6,37],[6,38,6,45],[6,46,6,53],[6,54,6,61],[6,6,6,9],[19,0,19,1],[19,3,19,5],[19,6,19,9],[20,0,20,1],[20,3,20,5],[20,6,20,9],[21,0,21,1],[21,3,21,5],[21,6,21,9],[22,0,22,1],[22,3,22,5],[22,6,22,9],[23,0,23,1],[23,3,23,5],[23,6,23,9],[24,0,24,1],[24,3,24,5],[24,6,24,9],[25,0,25,1],[25,3,25,5],[25,6,25,9],[26,0,26,1],[26,3,26,5],[26,6,26,9],[35,3,35,5],[35,6,35,9],[27,0,27,1],[27,3,27,5],[27,6,27,9],[28,0,28,1],[28,3,28,5],[28,6,28,9],[29,0,29,1],[29,3,29,5],[29,6,29,10],[34,3,34,5],[34,6,34,9]]}
[]
[]
["Intermediate Intention Sheet"]
[]
["Gymnast Name:",null,"Gender:",null,null," Gymnast No:",null,null,null,null,"Club:"]
[]
["ELEMENTS",null,"EXECUTION","DIFFICULTY",null,null,"GROUP",null,null,null,"SPECIAL REQUIREMENTS","BONUS",null,null,"Validation 1",null,null,null,null,null,null,null,"Validation 2",null,null,null,null,null,null,null,"Validation 3",null,null,null,null,null,null,null,"Validation 4",null,null,null,null,null,null,null,"Validation 5",null,null,null,null,null,null,null,"Validation 6",null,null,null,null,null,null,null,"Validation 7",null,null,null,null,null,null,null,"Validation 8",null,null,null,null,null,null,null,"Validation 9",null,null,null,null,null,null,null,"Validation 10",null,null,null,null,null,null,null,"G1 B","G1","Girls G2","Boys G2 H","Boys G2","AS","FS","B C","B G","Crt met b4 B"]
[null,null,null,"A","B","C",1,2,3,4,null,null,null,null,"found","list",null,null,null,null,"count if","ofset","found","list",null,null,null,null,"count if","ofset","found","list",null,null,null,null,"count if","ofset","found","list",null,null,null,null,"count if","ofset","found","list",null,null,null,null,"count if","ofset","found","list",null,null,null,null,"count if","ofset","found","list",null,null,null,null,"count if","ofset","found","list",null,null,null,null,"count if","ofset","found","list",null,null,null,null,"count if","ofset","found","list",null,null,null,null,"count if","ofset",null,null,null,null,null,null,null,null,null,null,"A","B",null,1,2,3,4]
[1,null,null,{"$f":"IFERROR(IF(VLOOKUP(B9,Moves!$A$1:$D$151,2,FALSE)=\"A\",\"X\",\" \"),\"\")","v":""},{"$f":"IFERROR(IF(VLOOKUP(B9,Moves!$A$1:$D$151,2,FALSE)=\"B\",\"X\",\" \"),\"\")","v":""},{"$f":"IFERROR(IF(VLOOKUP(B9,Moves!$A$1:$D$151,2,FALSE)=\"C\",\"X\",\" \"),\"\")","v":""},{"$f":"IFERROR(IF(VLOOKUP(B9,Moves!$A$1:$D$151,3,FALSE)=1,\"X\",\" \"),\"\")","v":""},{"$f":"IFERROR(IF(VLOOKUP(B9,Moves!$A$1:$D$151,3,FALSE)=2,\"X\",\" \"),\"\")","v":""},{"$f":"IFERROR(IF(VLOOKUP(B9,Moves!$A$1:$D$151,3,FALSE)=3,\"X\",\" \"),\"\")","v":""},{"$f":"IFERROR(IF(VLOOKUP(B9,Moves!$A$1:$D$151,3,FALSE)=4,\"X\",\" \"),\"\")","v":""},null,null,null,null,{"$f":"IF(ISNUMBER(SEARCH($B$9,P9)),MAX($O$8:O8)+1,0)","v":1},"Straight jump",null,null,{"$f":"IFERROR(VLOOKUP(ROWS($P$9:P9),$O$9:$P$158,2,0),\"\")","v":"Straight jump"},null,{"$f":"COUNTIF(S9:S158,\"?*\")","v":76},{"$f":"OFFSET($S$9,,,COUNTIF($S$9:$S$158,\"?*\"))","v":"Straight jump"},{"$f":"IF(ISNUMBER(SEARCH($B$10,X9)),MAX($W$8:W8)+1,0)","v":1},"Straight jump",null,null,{"$f":"IFERROR(VLOOKUP(ROWS($X$9:X9),$W$9:$X$158,2,0),\"\")","v":"Straight jump"},null,{"$f":"COUNTIF(AA9:AA158,\"?*\")","v":76},{"$f":"OFFSET($AA$9,,,COUNTIF($AA$9:$AA$158,\"?*\"))","v":"Straight jump"},{"$f":"IF(ISNUMBER(SEARCH($B$11,AF9)),MAX($AE$8:AE8)+1,0)","v":1},"Straight jump",null,null,{"$f":"IFERROR(VLOOKUP(ROWS($AF$9:AF9),$AE$9:$AF$158,2,0),\"\")","v":"Straight jump"},null,{"$f":"COUNTIF(AI9:AI158,\"?*\")","v":76},{"$f":"OFFSET($AI$9,,,COUNTIF($AI$9:$AI$158,\"?*\"))","v":"Straight jump"},{"$f":"IF(ISNUMBER(SEARCH($B$12,AN9)),MAX($AM$8:AM8)+1,0)","v":1},"Straight jump",null,null,{"$f":"IFERROR(VLOOKUP(ROWS($AN$9:AN9),$AM$9:$AN$158,2,0),\"\")","v":"Straight jump"},null,{"$f":"COUNTIF(AQ9:AQ158,\"?*\")","v":76},{"$f":"OFFSET($AQ$9,,,COUNTIF($AQ$9:$AQ$158,\"?*\"))","v":"Straight jump"},{"$f":"IF(ISNUMBER(SEARCH($B$13,AV9)),MAX($AU$8:AU8)+1,0)","v":1},"Straight jump",null,null,{"$f":"IFERROR(VLOOKUP(ROWS($AV$9:AV9),$AU$9:$AV$158,2,0),\"\")","v":"Straight jump"},null,{"$f":"COUNTIF(AY9:AY158,\"?*\")","v":76},{"$f":"OFFSET($AY$9,,,COUNTIF($AY$9:$AY$158,\"?*\"))","v":"Straight jump"},{"$f":"IF(ISNUMBER(SEARCH($B$14,BD9)),MAX($BC$8:BC8)+1,0)","v":1},"Straight jump",null,null,{"$f":"IFERROR(VLOOKUP(ROWS($BD$9:BD9),$BC$9:$BD$158,2,0),\"\")","v":"Straight jump"},null,{"$f":"COUNTIF(BG9:BG158,\"?*\")","v":76},{"$f":"OFFSET($BG$9,,,COUNTIF($BG$9:$BG$158,\"?*\"))","v":"Straight jump"},{"$f":"IF(ISNUMBER(SEARCH($B$15,BL9)),MAX($BK$8:BK8)+1,0)","v":1},"Straight jump",null,null,{"$f":"IFERROR(VLOOKUP(ROWS($BL$9:BL9),$BK$9:$BL$158,2,0),\"\")","v":"Straight jump"},null,{"$f":"COUNTIF(BO9:BO158,\"?*\")","v":76},{"$f":"OFFSET($BO$9,,,COUNTIF($BO$9:$BO$158,\"?*\"))","v":"Straight jump"},{"$f":"IF(ISNUMBER(SEARCH($B$16,BT9)),MAX($BS$8:BS8)+1,0)","v":1},"Straight jump",null,null,{"$f":"IFERROR(VLOOKUP(ROWS($BT$9:BT9),$BS$9:$BT$158,2,0),\"\")","v":"Straight jump"},null,{"$f":"COUNTIF(BW9:BW158,\"?*\")","v":76},{"$f":"OFFSET($BW$9,,,COUNTIF($BW$9:$BW$158,\"?*\"))","v":"Straight jump"},{"$f":"IF(ISNUMBER(SEARCH($B$17,CB9)),MAX($CA$8:CA8)+1,0)","v":1},"Straight jump",null,null,{"$f":"IFERROR(VLOOKUP(ROWS($CB$9:CB9),$CA$9:$CB$158,2,0),\"\")","v":"Straight jump"},null,{"$f":"COUNTIF(CE9:CE158,\"?*\")","v":76},{"$f":"OFFSET($CE$9,,,COUNTIF($CE$9:$CE$158,\"?*\"))","v":"Straight jump"},{"$f":"IF(ISNUMBER(SEARCH($B$18,CJ9)),MAX($CI$8:CI8)+1,0)","v":1},"Straight jump",null,null,{"$f":"IFERROR(VLOOKUP(ROWS($CJ$9:CJ9),$CI$9:$CJ$158,2,0),\"\")","v":"Straight jump"},null,{"$f":"COUNTIF(CM9:CM158,\"?*\")","v":76},{"$f":"OFFSET($CM$9,,,COUNTIF($CM$9:$CM$158,\"?*\"))","v":"Straight jump"},{"$f":"IF(D5=\"Male\",\"\",IF(K9<>$K$37,\"\",IF(G9=\"X\",IF(E9=\"X\",\"Yes\",\"No\"),\"No\")))","v":""},{"$f":"IF(K9<>$K$39,\"\",IF(G9=\"X\",\"Yes\",\"No\"))","v":""},{"$f":"IF($D$5=$K$33,IF(K9=$K$38,IF(H9=\"X\",\"Yes\",\"No\"),\"\"),\"\")","v":""},{"$f":"IF($D$5=\"Female\",\"\",IF(K9=$K$45,IF(H9=\"X\",\"Yes\",\"No\"),\"No\"))","v":"No"},{"$f":"IF($D$5=$K$34,IF(K9=$K$44,IF(H9=\"X\",\"Yes\",\"No\"),\"No\"),\"\")","v":""},{"$f":"IF(K9<>\"Acrobatic skill\",\"\",IF(VLOOKUP(B9,Moves!$A$1:$D$151,4,FALSE)=\"\",IF(I9=\"X\",\"Yes\",IF(J9=\"X\",\"Yes\",\"No\")),\"No\"))","v":""},{"$f":"IF(K9<>\"Flight skill\",\"\",IF(J9=\"X\",IF(VLOOKUP(B9,Moves!$A$1:$D$151,4,FALSE)<>\"FS\",\"No\",\"Yes\"),\"No\"))","v":""},{"$f":"IF(L9<>$L$32,\"\",IF(F9=\"X\",IF(G9=\"X\",\"Yes\",IF(H9=\"X\",\"Yes\",IF(I9=\"X\",\"Yes\",\"No\")))))","v":""},{"$f":"IF(CX9<>\"Yes\",\"\",IF(G9=\"X\",1,IF(H9=\"X\",2,IF(I9=\"X\",3,\"No\"))))","v":""},{"$f":"IF(COUNTIF(O9:CY9,\"Yes\")=2,\"No\",\"Yes\")","v":"Yes"},{"$f":"IF(D9=\"X\",IF(L9=\"Bonus - C Skill\",\"No\",\"Yes\"),\"\")","v":""},{"$f":"IF(E9=\"X\",IF(L9=\"Bonus - C Skill\",\"No\",\"Yes\"),\"\")","v":""},null,{"$f":"IF(G9=\"X\",IF(L9=\"Bonus - C Skill\",\"No\",\"Yes\"),\"\")","v":""},{"$f":"IF(H9=\"X\",IF(L9=\"Bonus - C Skill\",\"No\",\"Yes\"),\"\")","v":""},{"$f":"IF(I9=\"X\",IF(L9=\"Bonus - C Skill\",\"No\",\"Yes\"),\"\")","v":""},{"$f":"IF(J9=\"X\",IF(L9=\"Bonus - C Skill\",\"No\",\"Yes\"),\"\")","v":""}]
[2,null,null,{"$f":"IFERROR(IF(VLOOKUP(B10,Moves!$A$1:$D$151,2,FALSE)=\"A\",\"X\",\" \"),\"\")","v":""},{"$f":"IFERROR(IF(VLOOKUP(B10,Moves!$A$1:$D$151,2,FALSE)=\"B\",\"X\",\" \"),\"\")","v":""},{"$f":"IFERROR(IF(VLOOKUP(B10,Moves!$A$1:$D$151,2,FALSE)=\"C\",\"X\",\" \"),\"\")","v":""},{"$f":"IFERROR(IF(VLOOKUP(B10,Moves!$A$1:$D$151,3,FALSE)=1,\"X\",\" \"),\"\")","v":""},{"$f":"IFERROR(IF(VLOOKUP(B10,Moves!$A$1:$D$151,3,FALSE)=2,\"X\",\" \"),\"\")","v":""},{"$f":"IFERROR(IF(VLOOKUP(B10,Moves!$A$1:$D$151,3,FALSE)=3,\"X\",\" \"),\"\")","v":""},{"$f":"IFERROR(IF(VLOOKUP(B10,Moves!$A$1:$D$151,3,FALSE)=4,\"X\",\" \"),\"\")","v":""},null,null,null,null,{"$f":"IF(ISNUMBER(SEARCH($B$9,P10)),MAX($O$8:O9)+1,0)","v":2},"Jump ½ turn ",null,null,{"$f":"IFERROR(VLOOKUP(ROWS($P$9:P10),$O$9:$P$158,2,0),\"\")","v":"Jump ½ turn "},null,null,null,{"$f":"IF(ISNUMBER(SEARCH($B$10,X10)),MAX($W$8:W9)+1,0)","v":2},"Jump ½ turn ",null,null,{"$f":"IFERROR(VLOOKUP(ROWS($X$9:X10),$W$9:$X$158,2,0),\"\")","v":"Jump ½ turn "},null,null,null,{"$f":"IF(ISNUMBER(SEARCH($B$11,AF10)),MAX($AE$8:AE9)+1,0)","v":2},"Jump ½ turn ",null,null,{"$f":"IFERROR(VLOOKUP(ROWS($AF$9:AF10),$AE$9:$AF$158,2,0),\"\")","v":"Jump ½ turn "},null,null,null,{"$f":"IF(ISNUMBER(SEARCH($B$12,AN10)),MAX($AM$8:AM9)+1,0)","v":2},"Jump ½ turn ",null,null,{"$f":"IFERROR(VLOOKUP(ROWS($AN$9:AN10),$AM$9:$AN$158,2,0),\"\")","v":"Jump ½ turn "},null,null,null,{"$f":"IF(ISNUMBER(SEARCH($B$13,AV10)),MAX($AU$8:AU9)+1,0)","v":2},"Jump ½ turn ",null,null,{"$f":"IFERROR(VLOOKUP(ROWS($AV$9:AV10),$AU$9:$AV$158,2,0),\"\")","v":"Jump ½ turn "},null,null,null,{"$f":"IF(ISNUMBER(SEARCH($B$14,BD10)),MAX($BC$8:BC9)+1,0)","v":2},"Jump ½ turn ",null,null,{"$f":"IFERROR(VLOOKUP(ROWS($BD$9:BD10),$BC$9:$BD$158,2,0),\"\")","v":"Jump ½ turn "},null,null,null,{"$f":"IF(ISNUMBER(SEARCH($B$15,BL10)),MAX($BK$8:BK9)+1,0)","v":2},"Jump ½ turn ",null,null,{"$f":"IFERROR(VLOOKUP(ROWS($BL$9:BL10),$BK$9:$BL$158,2,0),\"\")","v":"Jump ½ turn "},null,null,null,{"$f":"IF(ISNUMBER(SEARCH($B$16,BT10)),MAX($BS$8:BS9)+1,0)","v":2},"Jump ½ turn ",null,null,{"$f":"IFERROR(VLOOKUP(ROWS($BT$9:BT10),$BS$9:$BT$158,2,0),\"\")","v":"Jump ½ turn "},null,null,null,{"$f":"IF(ISNUMBER(SEARCH($B$17,CB10)),MAX($CA$8:CA9)+1,0)","v":2},"Jump ½ turn ",null,null,{"$f":"IFERROR(VLOOKUP(ROWS($CB$9:CB10),$CA$9:$CB$158,2,0),\"\")","v":"Jump ½ turn "},null,null,null,{"$f":"IF(ISNUMBER(SEARCH($B$18,CJ10)),MAX($CI$8:CI9)+1,0)","v":2},"Jump ½ turn ",null,null,{"$f":"IFERROR(VLOOKUP(ROWS($CJ$9:CJ10),$CI$9:$CJ$158,2,0),\"\")","v":"Jump ½ turn "},null,null,null,{"$f":"IF(D6=\"Male\",\"\",IF(K10<>$K$37,\"\",IF(G10=\"X\",IF(E10=\"X\",\"Yes\",\"No\"),\"No\")))","v":""},{"$f":"IF(K10<>$K$39,\"\",IF(G10=\"X\",\"Yes\",\"No\"))","v":""},{"$f":"IF($D$5=$K$33,IF(K10=$K$38,IF(H10=\"X\",\"Yes\",\"No\"),\"\"),\"\")","v":""},"No","",{"$f":"IF(K10<>\"Acrobatic skill\",\"\",IF(VLOOKUP(B10,Moves!$A$1:$D$151,4,FALSE)=\"\",IF(I10=\"X\",\"Yes\",IF(J10=\"X\",\"Yes\",\"No\")),\"No\"))","v":""},{"$f":"IF(K10<>\"Flight skill\",\"\",IF(J10=\"X\",IF(VLOOKUP(B10,Moves!$A$1:$D$151,4,FALSE)<>\"FS\",\"No\",\"Yes\"),\"No\"))","v":""},"",{"$f":"IF(CX10<>\"Yes\",\"\",IF(G10=\"X\",1,IF(H10=\"X\",2,IF(I10=\"X\",3,\"No\"))))","v":""},{"$f":"IF(COUNTIF(O10:CY10,\"Yes\")=2,\"No\",\"Yes\")","v":"Yes"},{"$f":"IF(D10=\"X\",IF(L10=\"Bonus - C Skill\",\"No\",\"Yes\"),\"\")","v":""},{"$f":"IF(E10=\"X\",IF(L10=\"Bonus - C Skill\",\"No\",\"Yes\"),\"\")","v":""},null,{"$f":"IF(G10=\"X\",IF(L10=\"Bonus - C Skill\",\"No\",\"Yes\"),\"\")","v":""},{"$f":"IF(H10=\"X\",IF(L10=\"Bonus - C Skill\",\"No\",\"Yes\"),\"\")","v":""},{"$f":"IF(I10=\"X\",IF(L10=\"Bonus - C Skill\",\"No\",\"Yes\"),\"\")","v":""},{"$f":"IF(J10=\"X\",IF(L10=\"Bonus - C Skill\",\"No\",\"Yes\"),\"\")","v":""}]
{"$rows_left_out":149}
{"sheet":"Moves","index":1,"n_rows":151,"n_cols":99,"rows_kept":151,"cut":false,"hidden":true,"merged":[]}
["Straight jump","A",1,"Leap/Hop"]
["Jump ½ turn ","A",1,"Leap/Hop"]
["Star jump ","A",1,"Leap/Hop"]
["Tuck jump","A",1,"Leap/Hop"]
["2 x dynamic 1/2 turns on knees","A",1,"Leap/Hop"]
["1 leg balance ","A",2]
["Splits (F or S) ","A",2]
["Japana (up to 45⁰ chest)","A",2]
["D Shape","A",2,null,null,null,null,null,null,null,null,null,null,null,null,null,null,null,null,null,null,null,null,null,null,null,null,null,null,null,null,null,null,null,null,null,null,null,null,null,null,null,null,null,null,null,null,null,null,null,null,null,null,null,null,null,null,null,null,null,null,null,null,null,null,null,null,null,null,null,null,null,null,null,null,null,null,null,null,null,null,null,null,null,null,null,null,null,null,null,null,null,null,null,null,null,null,null,{"$f":"IF(M9<>$M$40,\"\")","v":false}]
["Bridge","A",2]
{"$rows_left_out":141}