{"text_format":"1","workbook":"xlsx","n_sheets":2,"sheets":["Template","Moves"],"not_rendered":{"charts":0,"images":0,"macros":1,"external_links":0,"defined_names":26,"comments":0,"pivot_tables":0},"unopened":[],"bounds":{"document_bytes":16777216,"sheet_cells":100000,"rows_first":2000,"rows_last":500,"rows_between":2000,"halvings":0,"cell_chars":16384,"cell_head_chars":4096},"cells_cut":0,"cells_raw":0,"read":"whole","date_system":"1900"}

{"sheet":"Template","index":0,"n_rows":162,"n_cols":116,"rows_kept":162,"cut":false,"hidden":false,"merged":[[4,0,4,1],[4,3,4,4],[6,0,7,1],[6,3,6,6],[6,7,6,10],[5,0,5,1],[4,5,4,8],[4,9,4,10],[6,63,6,70],[6,71,6,78],[6,79,6,86],[6,87,6,94],[18,3,18,6],[18,7,18,10],[6,15,6,22],[6,23,6,30],[6,31,6,38],[6,39,6,46],[6,47,6,54],[6,55,6,62],[19,0,19,1],[19,3,19,6],[19,7,19,10],[20,0,20,1],[20,3,20,6],[20,7,20,10],[21,0,21,1],[21,3,21,6],[21,7,21,10],[22,0,22,1],[22,3,22,6],[22,7,22,10],[23,0,23,1],[23,3,23,6],[23,7,23,10],[24,0,24,1],[24,3,24,6],[24,7,24,10],[25,0,25,1],[25,3,25,6],[25,7,25,10],[26,0,26,1],[26,3,26,6],[26,7,26,10],[35,3,35,6],[35,7,35,10],[27,0,27,1],[27,3,27,6],[27,7,27,10],[28,0,28,1],[28,3,28,6],[28,7,28,10],[29,0,29,1],[29,3,29,6],[29,7,29,11],[34,3,34,6],[34,7,34,10]]}
[]
[]
["Advanced Intention Sheet"]
[]
["Gymnast Name:",null,"Gender:",null,null," Gymnast No:",null,null,null,null,null,"Club:"]
[]
["ELEMENTS",null,"EXECUTION","DIFFICULTY",null,null,null,"GROUP",null,null,null,"SPECIAL REQUIREMENTS","BONUS",null,null,"Validation 1",null,null,null,null,null,null,null,"Validation 2",null,null,null,null,null,null,null,"Validation 3",null,null,null,null,null,null,null,"Validation 4",null,null,null,null,null,null,null,"Validation 5",null,null,null,null,null,null,null,"Validation 6",null,null,null,null,null,null,null,"Validation 7",null,null,null,null,null,null,null,"Validation 8",null,null,null,null,null,null,null,"Validation 9",null,null,null,null,null,null,null,"Validation 10",null,null,null,null,null,null,null,"G1","Girls G2","Boys G2 H","Boys G2","MS","MS G","AS","FS","B1","B2","Crt met b4 B",null,null,null,null,null,null,null,"C skill","C Skill G","B1 G"]
[null,null,null,"A","B","C","D",1,2,3,4,null,null,null,null,"found","list",null,null,null,null,"count if","ofset","found","list",null,null,null,null,"count if","ofset","found","list",null,null,null,null,"count if","ofset","found","list",null,null,null,null,"count if","ofset","found","list",null,null,null,null,"count if","ofset","found","list",null,null,null,null,"count if","ofset","found","list",null,null,null,null,"count if","ofset","found","list",null,null,null,null,"count if","ofset","found","list",null,null,null,null,"count if","ofset","found","list",null,null,null,null,"count if","ofset",null,null,null,null,null,null,null,null,null,null,null,"A","B","C",1,2,3,4]
[1,null,null,{"$f":"IFERROR(IF(VLOOKUP(B9,Moves!$A$1:$D$150,2,FALSE)=\"A\",\"X\",\" \"),\"\")","v":""},{"$f":"IFERROR(IF(VLOOKUP(B9,Moves!$A$1:$D$150,2,FALSE)=\"B\",\"X\",\" \"),\"\")","v":""},{"$f":"IFERROR(IF(VLOOKUP(B9,Moves!$A$1:$D$150,2,FALSE)=\"C\",\"X\",\" \"),\"\")","v":""},{"$f":"IFERROR(IF(VLOOKUP(B9,Moves!$A$1:$D$150,2,FALSE)=\"D\",\"X\",\" \"),\"\")","v":""},{"$f":"IFERROR(IF(VLOOKUP(B9,Moves!$A$1:$D$150,3,FALSE)=1,\"X\",\" \"),\"\")","v":""},{"$f":"IFERROR(IF(VLOOKUP(B9,Moves!$A$1:$D$150,3,FALSE)=2,\"X\",\" \"),\"\")","v":""},{"$f":"IFERROR(IF(VLOOKUP(B9,Moves!$A$1:$D$150,3,FALSE)=3,\"X\",\" \"),\"\")","v":""},{"$f":"IFERROR(IF(VLOOKUP(B9,Moves!$A$1:$D$150,3,FALSE)=4,\"X\",\" \"),\"\")","v":""},null,null,null,null,{"$f":"IF(ISNUMBER(SEARCH($B$9,Q9)),MAX($P$8:P8)+1,0)","v":1},"Straight jump",null,null,{"$f":"IFERROR(VLOOKUP(ROWS($Q$9:Q9),$P$9:$Q$162,2,0),\"\")","v":"Straight jump"},null,{"$f":"COUNTIF(T9:T162,\"?*\")","v":154},{"$f":"OFFSET($T$9,,,COUNTIF($T$9:$T$162,\"?*\"))","v":"Straight jump"},{"$f":"IF(ISNUMBER(SEARCH($B$10,Y9)),MAX($X$8:X8)+1,0)","v":1},"Straight jump",null,null,{"$f":"IFERROR(VLOOKUP(ROWS($Y$9:Y9),$X$9:$Y$162,2,0),\"\")","v":"Straight jump"},null,{"$f":"COUNTIF(AB9:AB162,\"?*\")","v":154},{"$f":"OFFSET($AB$9,,,COUNTIF($AB$9:$AB$162,\"?*\"))","v":"Straight jump"},{"$f":"IF(ISNUMBER(SEARCH($B$11,AG9)),MAX($AF$8:AF8)+1,0)","v":1},"Straight jump",null,null,{"$f":"IFERROR(VLOOKUP(ROWS($AG$9:AG9),$AF$9:$AG$162,2,0),\"\")","v":"Straight jump"},null,{"$f":"COUNTIF(AJ9:AJ162,\"?*\")","v":154},{"$f":"OFFSET($AJ$9,,,COUNTIF($AJ$9:$AJ$162,\"?*\"))","v":"Straight jump"},{"$f":"IF(ISNUMBER(SEARCH($B$12,AO9)),MAX($AN$8:AN8)+1,0)","v":1},"Straight jump",null,null,{"$f":"IFERROR(VLOOKUP(ROWS($AO$9:AO9),$AN$9:$AO$162,2,0),\"\")","v":"Straight jump"},null,{"$f":"COUNTIF(AR9:AR162,\"?*\")","v":154},{"$f":"OFFSET($AR$9,,,COUNTIF($AR$9:$AR$162,\"?*\"))","v":"Straight jump"},{"$f":"IF(ISNUMBER(SEARCH($B$13,AW9)),MAX($AV$8:AV8)+1,0)","v":1},"Straight jump",null,null,{"$f":"IFERROR(VLOOKUP(ROWS($AW$9:AW9),$AV$9:$AW$162,2,0),\"\")","v":"Straight jump"},null,{"$f":"COUNTIF(AZ9:AZ162,\"?*\")","v":154},{"$f":"OFFSET($AZ$9,,,COUNTIF($AZ$9:$AZ$162,\"?*\"))","v":"Straight jump"},{"$f":"IF(ISNUMBER(SEARCH($B$14,BE9)),MAX($BD$8:BD8)+1,0)","v":1},"Straight jump",null,null,{"$f":"IFERROR(VLOOKUP(ROWS($BE$9:BE9),$BD$9:$BE$162,2,0),\"\")","v":"Straight jump"},null,{"$f":"COUNTIF(BH9:BH162,\"?*\")","v":154},{"$f":"OFFSET($BH$9,,,COUNTIF($BH$9:$BH$162,\"?*\"))","v":"Straight jump"},{"$f":"IF(ISNUMBER(SEARCH($B$15,BM9)),MAX($BL$8:BL8)+1,0)","v":1},"Straight jump",null,null,{"$f":"IFERROR(VLOOKUP(ROWS($BM$9:BM9),$BL$9:$BM$162,2,0),\"\")","v":"Straight jump"},null,{"$f":"COUNTIF(BP9:BP162,\"?*\")","v":154},{"$f":"OFFSET($BP$9,,,COUNTIF($BP$9:$BP$162,\"?*\"))","v":"Straight jump"},{"$f":"IF(ISNUMBER(SEARCH($B$16,BU9)),MAX($BT$8:BT8)+1,0)","v":1},"Straight jump",null,null,{"$f":"IFERROR(VLOOKUP(ROWS($BU$9:BU9),$BT$9:$BU$162,2,0),\"\")","v":"Straight jump"},null,{"$f":"COUNTIF(BX9:BX162,\"?*\")","v":154},{"$f":"OFFSET($BX$9,,,COUNTIF($BX$9:$BX$162,\"?*\"))","v":"Straight jump"},{"$f":"IF(ISNUMBER(SEARCH($B$17,CC9)),MAX($CB$8:CB8)+1,0)","v":1},"Straight jump",null,null,{"$f":"IFERROR(VLOOKUP(ROWS($CC$9:CC9),$CB$9:$CC$162,2,0),\"\")","v":"Straight jump"},null,{"$f":"COUNTIF(CF9:CF162,\"?*\")","v":154},{"$f":"OFFSET($CF$9,,,COUNTIF($CF$9:$CF$162,\"?*\"))","v":"Straight jump"},{"$f":"IF(ISNUMBER(SEARCH($B$18,CK9)),MAX($CJ$8:CJ8)+1,0)","v":1},"Straight jump",null,null,{"$f":"IFERROR(VLOOKUP(ROWS($CK$9:CK9),$CJ$9:$CK$162,2,0),\"\")","v":"Straight jump"},null,{"$f":"COUNTIF(CN9:CN162,\"?*\")","v":154},{"$f":"OFFSET($CN$9,,,COUNTIF($CN$9:$CN$162,\"?*\"))","v":"Straight jump"},{"$f":"IF(L9<>$L$37,\"\",IF(H9=\"X\",IF(E9=\"X\",\"Yes\",IF(F9=\"X\",\"Yes\",\"No\")),\"No\"))","v":""},{"$f":"IF($D$5=$L$33,IF(L9=$L$38,IF(I9=\"X\",\"Yes\",\"No\"),\"\"),\"\")","v":""},{"$f":"IF($D$5=\"Female\",\"\",IF(L9=$L$44,IF(I9=\"X\",\"Yes\",\"No\"),\"No\"))","v":"No"},{"$f":"IF($D$5=$L$34,IF(L9=$L$43,IF(I9=\"X\",\"Yes\",\"No\"),\"No\"),\"\")","v":""},{"$f":"IF(L9=\"Mixed series\",IF(H9=\"X\",\"Yes\",IF(H9<>\"X\",\"Yes\",\"No\")),\"\")","v":""},{"$f":"IF(CV9<>\"Yes\",\"\",IF(H9=\"X\",1,IF(I9=\"X\",2,IF(J9=\"X\",3,IF(K9=\"X\",4,\"No\")))))","v":""},{"$f":"IF(L9<>\"Acrobatic skill\",\"\",IF(VLOOKUP(B9,Moves!$A$1:$D$150,4,FALSE)=\"\",IF(J9=\"X\",\"Yes\",IF(K9=\"X\",\"Yes\",\"No\")),\"No\"))","v":""},{"$f":"IF(L9<>\"Flight skill/series\",\"\",IF(K9=\"X\",IF(VLOOKUP(B9,Moves!A1:D150,4,FALSE)<>\"\",\"Yes\",\"No\"),\"No\"))","v":""},{"$f":"IF(M9<>$M$32,\"\",IF(F9=\"X\",IF(H9=\"X\",\"Yes\",IF(I9=\"X\",\"Yes\",IF(J9=\"X\",\"Yes\",\"No\")))))","v":""},{"$f":"IF(M9<>$M$33,\"\",IF(G9<>\"X\",\"No\",IF(VLOOKUP(B9,Moves!$A$1:$D$150,3,FALSE)<>4,IF(H9=\"X\",\"Yes\",IF(I9=\"X\",\"Yes\",IF(J9=\"X\",\"Yes\"))))))","v":""},{"$f":"IF(COUNTIF(P9:DA9,\"Yes\")=2,\"No\",\"Yes\")","v":"Yes"},{"$f":"IF(D9=\"X\",IF(M9=\"Bonus - C Skill\",\"No\",IF(M9=\"Bonus - D Skill\",\"No\",\"Yes\")),\"\")","v":""},{"$f":"IF(E9=\"X\",IF(M9=\"Bonus - C Skill\",\"No\",IF(M9=\"Bonus - D Skill\",\"No\",\"Yes\")),\"\")","v":""},{"$f":"IF(F9=\"X\",IF(M9=\"Bonus - C Skill\",\"No\",IF(M9=\"Bonus - D Skill\",\"No\",\"Yes\")),\"\")","v":""},{"$f":"IF(H9=\"X\",IF(M9=\"Bonus - C Skill\",\"No\",IF(M9=\"Bonus - D Skill\",\"No\",\"Yes\")),\"\")","v":""},{"$f":"IF(I9=\"X\",IF(M9=\"Bonus - C Skill\",\"No\",IF(M9=\"Bonus - D Skill\",\"No\",\"Yes\")),\"\")","v":""},{"$f":"IF(J9=\"X\",IF(M9=\"Bonus - C Skill\",\"No\",IF(M9=\"Bonus - D Skill\",\"No\",\"Yes\")),\"\")","v":""},{"$f":"IF(K9=\"X\",IF(M9=\"Bonus - C Skill\",\"No\",IF(M9=\"Bonus - D Skill\",\"No\",\"Yes\")),\"\")","v":""},{"$f":"IF(M9=\"\",IF(F9=\"X\",\"Yes\",\"\"),\"\")","v":""},{"$f":"IF(DJ9<>\"Yes\",\"\",IF(H9=\"X\",1,IF(I9=\"X\",2,IF(J9=\"X\",3,IF(K9=\"X\",4,\"No\")))))","v":""},{"$f":"IF(CZ9<>\"Yes\",\"\",IF(H9=\"X\",1,IF(I9=\"X\",2,IF(J9=\"X\",3,IF(K9=\"X\",4,\"No\")))))","v":""}]
[2,null,null,{"$f":"IFERROR(IF(VLOOKUP(B10,Moves!$A$1:$D$150,2,FALSE)=\"A\",\"X\",\" \"),\"\")","v":""},{"$f":"IFERROR(IF(VLOOKUP(B10,Moves!$A$1:$D$150,2,FALSE)=\"B\",\"X\",\" \"),\"\")","v":""},{"$f":"IFERROR(IF(VLOOKUP(B10,Moves!$A$1:$D$150,2,FALSE)=\"C\",\"X\",\" \"),\"\")","v":""},{"$f":"IFERROR(IF(VLOOKUP(B10,Moves!$A$1:$D$150,2,FALSE)=\"D\",\"X\",\" \"),\"\")","v":""},{"$f":"IFERROR(IF(VLOOKUP(B10,Moves!$A$1:$D$150,3,FALSE)=1,\"X\",\" \"),\"\")","v":""},{"$f":"IFERROR(IF(VLOOKUP(B10,Moves!$A$1:$D$150,3,FALSE)=2,\"X\",\" \"),\"\")","v":""},{"$f":"IFERROR(IF(VLOOKUP(B10,Moves!$A$1:$D$150,3,FALSE)=3,\"X\",\" \"),\"\")","v":""},{"$f":"IFERROR(IF(VLOOKUP(B10,Moves!$A$1:$D$150,3,FALSE)=4,\"X\",\" \"),\"\")","v":""},null,null,null,null,{"$f":"IF(ISNUMBER(SEARCH($B$9,Q10)),MAX($P$8:P9)+1,0)","v":2},"Jump ½ turn ",null,null,{"$f":"IFERROR(VLOOKUP(ROWS($Q$9:Q10),$P$9:$Q$162,2,0),\"\")","v":"Jump ½ turn "},null,null,null,{"$f":"IF(ISNUMBER(SEARCH($B$10,Y10)),MAX($X$8:X9)+1,0)","v":2},"Jump ½ turn ",null,null,{"$f":"IFERROR(VLOOKUP(ROWS($Y$9:Y10),$X$9:$Y$162,2,0),\"\")","v":"Jump ½ turn "},null,null,null,{"$f":"IF(ISNUMBER(SEARCH($B$11,AG10)),MAX($AF$8:AF9)+1,0)","v":2},"Jump ½ turn ",null,null,{"$f":"IFERROR(VLOOKUP(ROWS($AG$9:AG10),$AF$9:$AG$162,2,0),\"\")","v":"Jump ½ turn "},null,null,null,{"$f":"IF(ISNUMBER(SEARCH($B$12,AO10)),MAX($AN$8:AN9)+1,0)","v":2},"Jump ½ turn ",null,null,{"$f":"IFERROR(VLOOKUP(ROWS($AO$9:AO10),$AN$9:$AO$162,2,0),\"\")","v":"Jump ½ turn "},null,null,null,{"$f":"IF(ISNUMBER(SEARCH($B$13,AW10)),MAX($AV$8:AV9)+1,0)","v":2},"Jump ½ turn ",null,null,{"$f":"IFERROR(VLOOKUP(ROWS($AW$9:AW10),$AV$9:$AW$162,2,0),\"\")","v":"Jump ½ turn "},null,null,null,{"$f":"IF(ISNUMBER(SEARCH($B$14,BE10)),MAX($BD$8:BD9)+1,0)","v":2},"Jump ½ turn ",null,null,{"$f":"IFERROR(VLOOKUP(ROWS($BE$9:BE10),$BD$9:$BE$162,2,0),\"\")","v":"Jump ½ turn "},null,null,null,{"$f":"IF(ISNUMBER(SEARCH($B$15,BM10)),MAX($BL$8:BL9)+1,0)","v":2},"Jump ½ turn ",null,null,{"$f":"IFERROR(VLOOKUP(ROWS($BM$9:BM10),$BL$9:$BM$162,2,0),\"\")","v":"Jump ½ turn "},null,null,null,{"$f":"IF(ISNUMBER(SEARCH($B$16,BU10)),MAX($BT$8:BT9)+1,0)","v":2},"Jump ½ turn ",null,null,{"$f":"IFERROR(VLOOKUP(ROWS($BU$9:BU10),$BT$9:$BU$162,2,0),\"\")","v":"Jump ½ turn "},null,null,null,{"$f":"IF(ISNUMBER(SEARCH($B$17,CC10)),MAX($CB$8:CB9)+1,0)","v":2},"Jump ½ turn ",null,null,{"$f":"IFERROR(VLOOKUP(ROWS($CC$9:CC10),$CB$9:$CC$162,2,0),\"\")","v":"Jump ½ turn "},null,null,null,{"$f":"IF(ISNUMBER(SEARCH($B$18,CK10)),MAX($CJ$8:CJ9)+1,0)","v":2},"Jump ½ turn ",null,null,{"$f":"IFERROR(VLOOKUP(ROWS($CK$9:CK10),$CJ$9:$CK$162,2,0),\"\")","v":"Jump ½ turn "},null,null,null,"","",{"$f":"IF($D$5=\"Female\",\"\",IF(L10=$L$44,IF(I10=\"X\",\"Yes\",\"No\"),\"No\"))","v":"No"},{"$f":"IF($D$5=$L$34,IF(L10=$L$43,IF(I10=\"X\",\"Yes\",\"No\"),\"No\"),\"\")","v":""},"","",{"$f":"IF(L10<>\"Acrobatic skill\",\"\",IF(VLOOKUP(B10,Moves!$A$1:$D$150,4,FALSE)=\"\",IF(J10=\"X\",\"Yes\",IF(K10=\"X\",\"Yes\",\"No\")),\"No\"))","v":""},{"$f":"IF(L10<>\"Flight skill/series\",\"\",IF(K10=\"X\",IF(VLOOKUP(B10,Moves!A2:D151,4,FALSE)<>\"\",\"Yes\",\"No\"),\"No\"))","v":""},"",{"$f":"IF(M10<>$M$33,\"\",IF(G10<>\"X\",\"No\",IF(VLOOKUP(B10,Moves!$A$1:$D$150,3,FALSE)<>4,IF(H10=\"X\",\"Yes\",IF(I10=\"X\",\"Yes\",IF(J10=\"X\",\"Yes\"))))))","v":""},"Yes","","","","","","","","","",""]
{"$rows_left_out":153}
{"sheet":"Moves","index":1,"n_rows":154,"n_cols":99,"rows_kept":154,"cut":false,"hidden":true,"merged":[]}
["Straight jump","A",1,"Leap/Hop"]
["Jump ½ turn ","A",1,"Leap/Hop"]
["Star jump ","A",1,"Leap/Hop"]
["Tuck jump","A",1,"Leap/Hop"]
["2 x dynamic 1/2 turns on knees","A",1,"Leap/Hop"]
["1 leg balance ","A",2]
["Splits (F or S) ","A",2]
["Japana (up to 45⁰ chest)","A",2]
["D Shape","A",2,null,null,null,null,null,null,null,null,null,null,null,null,null,null,null,null,null,null,null,null,null,null,null,null,null,null,null,null,null,null,null,null,null,null,null,null,null,null,null,null,null,null,null,null,null,null,null,null,null,null,null,null,null,null,null,null,null,null,null,null,null,null,null,null,null,null,null,null,null,null,null,null,null,null,null,null,null,null,null,null,null,null,null,null,null,null,null,null,null,null,null,null,null,null,null,{"$f":"IF(M9<>$M$39,\"\")","v":false}]
["Bridge","A",2]
{"$rows_left_out":144}