{"text_format":"1","workbook":"xlsx","n_sheets":2,"sheets":["Template","Moves"],"not_rendered":{"charts":0,"images":0,"macros":1,"external_links":0,"defined_names":13,"comments":0,"pivot_tables":0},"unopened":[],"bounds":{"document_bytes":16777216,"sheet_cells":100000,"rows_first":2000,"rows_last":500,"rows_between":2000,"halvings":0,"cell_chars":16384,"cell_head_chars":4096},"cells_cut":0,"cells_raw":0,"read":"whole","date_system":"1900"}

{"sheet":"Template","index":0,"n_rows":160,"n_cols":105,"rows_kept":160,"cut":false,"hidden":false,"merged":[[29,0,29,1],[29,3,29,4],[29,5,29,9],[27,0,27,1],[27,3,27,4],[27,5,27,8],[28,0,28,1],[28,3,28,4],[28,5,28,8],[25,0,25,1],[25,3,25,4],[25,5,25,8],[26,0,26,1],[26,3,26,4],[26,5,26,8],[23,0,23,1],[23,3,23,4],[23,5,23,8],[24,0,24,1],[24,3,24,4],[24,5,24,8],[21,0,21,1],[21,3,21,4],[21,5,21,8],[22,0,22,1],[22,3,22,4],[22,5,22,8],[19,0,19,1],[19,3,19,4],[19,5,19,8],[20,0,20,1],[20,3,20,4],[20,5,20,8],[6,61,6,68],[6,69,6,76],[6,77,6,84],[6,85,6,92],[18,3,18,4],[18,5,18,8],[6,13,6,20],[6,21,6,28],[6,29,6,36],[6,37,6,44],[6,45,6,52],[6,53,6,60],[6,5,6,8],[4,7,4,8],[4,0,4,1],[5,0,5,1],[6,0,7,1],[6,3,6,4],[4,4,4,6]]}
[]
[]
["Novice Intention Sheet"]
[]
["Gymnast Name:",null,"Gender:",null," Gymnast No:",null,null,null,null,"Club:"]
[]
["ELEMENTS",null,"EXECUTION","DIFFICULTY",null,"GROUP",null,null,null,"SPECIAL REQUIREMENTS","BONUS",null,null,"Validation 1",null,null,null,null,null,null,null,"Validation 2",null,null,null,null,null,null,null,"Validation 3",null,null,null,null,null,null,null,"Validation 4",null,null,null,null,null,null,null,"Validation 5",null,null,null,null,null,null,null,"Validation 6",null,null,null,null,null,null,null,"Validation 7",null,null,null,null,null,null,null,"Validation 8",null,null,null,null,null,null,null,"Validation 9",null,null,null,null,null,null,null,"Validation 10",null,null,null,null,null,null,null,"leap","G2","SS","B C","B G","Crt met b4 B"]
[null,null,null,"A","B",1,2,3,4,null,null,null,null,"found","list",null,null,null,null,"count if","ofset","found","list",null,null,null,null,"count if","ofset","found","list",null,null,null,null,"count if","ofset","found","list",null,null,null,null,"count if","ofset","found","list",null,null,null,null,"count if","ofset","found","list",null,null,null,null,"count if","ofset","found","list",null,null,null,null,"count if","ofset","found","list",null,null,null,null,"count if","ofset","found","list",null,null,null,null,"count if","ofset","found","list",null,null,null,null,"count if","ofset",null,null,null,null,null,null,"A","B",1,2,3,4]
[1,null,null,{"$f":"IFERROR(IF(VLOOKUP(B9,Moves!$A$1:$D$53,2,FALSE)=\"A\",\"X\",\" \"),\"\")","v":""},{"$f":"IFERROR(IF(VLOOKUP(B9,Moves!$A$1:$D$53,2,FALSE)=\"B\",\"X\",\" \"),\"\")","v":""},{"$f":"IFERROR(IF(VLOOKUP(B9,Moves!$A$1:$D$53,3,FALSE)=1,\"X\",\" \"),\"\")","v":""},{"$f":"IFERROR(IF(VLOOKUP(B9,Moves!$A$1:$D$53,3,FALSE)=2,\"X\",\" \"),\"\")","v":""},{"$f":"IFERROR(IF(VLOOKUP(B9,Moves!$A$1:$D$53,3,FALSE)=3,\"X\",\" \"),\"\")","v":""},{"$f":"IFERROR(IF(VLOOKUP(B9,Moves!$A$1:$D$53,3,FALSE)=4,\"X\",\" \"),\"\")","v":""},null,null,null,null,{"$f":"IF(ISNUMBER(SEARCH($B$9,O9)),MAX($N$8:N8)+1,0)","v":1},"Straight jump",null,null,{"$f":"IFERROR(VLOOKUP(ROWS($O$9:O9),$N$9:$O$160,2,0),\"\")","v":"Straight jump"},null,{"$f":"COUNTIF(R9:R160,\"?*\")","v":51},{"$f":"OFFSET($R$9,,,COUNTIF($R$9:$R$160,\"?*\"))","v":"Straight jump"},{"$f":"IF(ISNUMBER(SEARCH($B$10,W9)),MAX($V$8:V8)+1,0)","v":1},"Straight jump",null,null,{"$f":"IFERROR(VLOOKUP(ROWS($W$9:W9),$V$9:$W$160,2,0),\"\")","v":"Straight jump"},null,{"$f":"COUNTIF(Z9:Z160,\"?*\")","v":51},{"$f":"OFFSET($Z$9,,,COUNTIF($Z$9:$Z$160,\"?*\"))","v":"Straight jump"},{"$f":"IF(ISNUMBER(SEARCH($B$11,AE9)),MAX($AD$8:AD8)+1,0)","v":1},"Straight jump",null,null,{"$f":"IFERROR(VLOOKUP(ROWS($AE$9:AE9),$AD$9:$AE$160,2,0),\"\")","v":"Straight jump"},null,{"$f":"COUNTIF(AH9:AH160,\"?*\")","v":51},{"$f":"OFFSET($AH$9,,,COUNTIF($AH$9:$AH$160,\"?*\"))","v":"Straight jump"},{"$f":"IF(ISNUMBER(SEARCH($B$12,AM9)),MAX($AL$8:AL8)+1,0)","v":1},"Straight jump",null,null,{"$f":"IFERROR(VLOOKUP(ROWS($AM$9:AM9),$AL$9:$AM$160,2,0),\"\")","v":"Straight jump"},null,{"$f":"COUNTIF(AP9:AP160,\"?*\")","v":51},{"$f":"OFFSET($AP$9,,,COUNTIF($AP$9:$AP$160,\"?*\"))","v":"Straight jump"},{"$f":"IF(ISNUMBER(SEARCH($B$13,AU9)),MAX($AT$8:AT8)+1,0)","v":1},"Straight jump",null,null,{"$f":"IFERROR(VLOOKUP(ROWS($AU$9:AU9),$AT$9:$AU$160,2,0),\"\")","v":"Straight jump"},null,{"$f":"COUNTIF(AX9:AX160,\"?*\")","v":51},{"$f":"OFFSET($AX$9,,,COUNTIF($AX$9:$AX$160,\"?*\"))","v":"Straight jump"},{"$f":"IF(ISNUMBER(SEARCH($B$14,BC9)),MAX($BB$8:BB8)+1,0)","v":1},"Straight jump",null,null,{"$f":"IFERROR(VLOOKUP(ROWS($BC$9:BC9),$BB$9:$BC$160,2,0),\"\")","v":"Straight jump"},null,{"$f":"COUNTIF(BF9:BF160,\"?*\")","v":51},{"$f":"OFFSET($BF$9,,,COUNTIF($BF$9:$BF$160,\"?*\"))","v":"Straight jump"},{"$f":"IF(ISNUMBER(SEARCH($B$15,BK9)),MAX($BJ$8:BJ8)+1,0)","v":1},"Straight jump",null,null,{"$f":"IFERROR(VLOOKUP(ROWS($BK$9:BK9),$BJ$9:$BK$160,2,0),\"\")","v":"Straight jump"},null,{"$f":"COUNTIF(BN9:BN160,\"?*\")","v":51},{"$f":"OFFSET($BN$9,,,COUNTIF($BN$9:$BN$160,\"?*\"))","v":"Straight jump"},{"$f":"IF(ISNUMBER(SEARCH($B$16,BS9)),MAX($BR$8:BR8)+1,0)","v":1},"Straight jump",null,null,{"$f":"IFERROR(VLOOKUP(ROWS($BS$9:BS9),$BR$9:$BS$160,2,0),\"\")","v":"Straight jump"},null,{"$f":"COUNTIF(BV9:BV160,\"?*\")","v":51},{"$f":"OFFSET($BV$9,,,COUNTIF($BV$9:$BV$160,\"?*\"))","v":"Straight jump"},{"$f":"IF(ISNUMBER(SEARCH($B$17,CA9)),MAX($BZ$8:BZ8)+1,0)","v":1},"Straight jump",null,null,{"$f":"IFERROR(VLOOKUP(ROWS($CA$9:CA9),$BZ$9:$CA$160,2,0),\"\")","v":"Straight jump"},null,{"$f":"COUNTIF(CD9:CD160,\"?*\")","v":51},{"$f":"OFFSET($CD$9,,,COUNTIF($CD$9:$CD$160,\"?*\"))","v":"Straight jump"},{"$f":"IF(ISNUMBER(SEARCH($B$18,CI9)),MAX($CH$8:CH8)+1,0)","v":1},"Straight jump",null,null,{"$f":"IFERROR(VLOOKUP(ROWS($CI$9:CI9),$CH$9:$CI$160,2,0),\"\")","v":"Straight jump"},null,{"$f":"COUNTIF(CL9:CL160,\"?*\")","v":52},{"$f":"OFFSET($CL$9,,,COUNTIF($CL$9:$CL$160,\"?*\"))","v":"Straight jump"},{"$f":"IF($D$5=$J$33,IF(J9=$J$38,IF(F9=\"X\",\"Yes\",\"No\"),\"\"),\"\")","v":""},{"$f":"IF(J9=$J$37,IF(G9=\"X\",\"Yes\",\"No\"),\"\")","v":""},{"$f":"IF(J9<>$J$42,\"\",IF(G9=\"X\",IF(VLOOKUP(B9,Moves!A1:D53,4,FALSE)<>\"SS\",\"No\",\"Yes\"),\"No\"))","v":""},{"$f":"IF(K9<>$K$32,\"\",IF(E9=\"X\",IF(F9=\"X\",\"Yes\",IF(G9=\"X\",\"Yes\",IF(H9=\"X\",\"Yes\",IF(I9=\"X\",\"Yes\",\"No\"))))))","v":""},{"$f":"IF(CS9<>\"Yes\",\"\",IF(F9=\"X\",1,IF(G9=\"X\",2,IF(H9=\"X\",3,IF(I9=\"X\",4,\"No\")))))","v":""},{"$f":"IF(COUNTIF(N9:CT9,\"Yes\")=2,\"No\",\"Yes\")","v":"Yes"},{"$f":"IF(D9=\"X\",IF(K9=\"Bonus - C Skill\",\"No\",\"Yes\"),\"\")","v":""},{"$f":"IF(E9=\"X\",IF(K9=\"Bonus - B Skill\",\"No\",\"Yes\"),\"\")","v":""},{"$f":"IF(F9=\"X\",IF(K9=\"Bonus - C Skill\",\"No\",\"Yes\"),\"\")","v":""},{"$f":"IF(G9=\"X\",IF(K9=\"Bonus - C Skill\",\"No\",\"Yes\"),\"\")","v":""},{"$f":"IF(H9=\"X\",IF(K9=\"Bonus - C Skill\",\"No\",\"Yes\"),\"\")","v":""},{"$f":"IF(I9=\"X\",IF(K9=\"Bonus - C Skill\",\"No\",\"Yes\"),\"\")","v":""}]
[2,null,null,{"$f":"IFERROR(IF(VLOOKUP(B10,Moves!$A$1:$D$53,2,FALSE)=\"A\",\"X\",\" \"),\"\")","v":""},{"$f":"IFERROR(IF(VLOOKUP(B10,Moves!$A$1:$D$53,2,FALSE)=\"B\",\"X\",\" \"),\"\")","v":""},{"$f":"IFERROR(IF(VLOOKUP(B10,Moves!$A$1:$D$53,3,FALSE)=1,\"X\",\" \"),\"\")","v":""},{"$f":"IFERROR(IF(VLOOKUP(B10,Moves!$A$1:$D$53,3,FALSE)=2,\"X\",\" \"),\"\")","v":""},{"$f":"IFERROR(IF(VLOOKUP(B10,Moves!$A$1:$D$53,3,FALSE)=3,\"X\",\" \"),\"\")","v":""},{"$f":"IFERROR(IF(VLOOKUP(B10,Moves!$A$1:$D$53,3,FALSE)=4,\"X\",\" \"),\"\")","v":""},null,null,null,null,{"$f":"IF(ISNUMBER(SEARCH($B$9,O10)),MAX($N$8:N9)+1,0)","v":2},"Jump ½ turn ",null,null,{"$f":"IFERROR(VLOOKUP(ROWS($O$9:O10),$N$9:$O$160,2,0),\"\")","v":"Jump ½ turn "},null,null,null,{"$f":"IF(ISNUMBER(SEARCH($B$10,W10)),MAX($V$8:V9)+1,0)","v":2},"Jump ½ turn ",null,null,{"$f":"IFERROR(VLOOKUP(ROWS($W$9:W10),$V$9:$W$160,2,0),\"\")","v":"Jump ½ turn "},null,null,null,{"$f":"IF(ISNUMBER(SEARCH($B$11,AE10)),MAX($AD$8:AD9)+1,0)","v":2},"Jump ½ turn ",null,null,{"$f":"IFERROR(VLOOKUP(ROWS($AE$9:AE10),$AD$9:$AE$160,2,0),\"\")","v":"Jump ½ turn "},null,null,null,{"$f":"IF(ISNUMBER(SEARCH($B$12,AM10)),MAX($AL$8:AL9)+1,0)","v":2},"Jump ½ turn ",null,null,{"$f":"IFERROR(VLOOKUP(ROWS($AM$9:AM10),$AL$9:$AM$160,2,0),\"\")","v":"Jump ½ turn "},null,null,null,{"$f":"IF(ISNUMBER(SEARCH($B$13,AU10)),MAX($AT$8:AT9)+1,0)","v":2},"Jump ½ turn ",null,null,{"$f":"IFERROR(VLOOKUP(ROWS($AU$9:AU10),$AT$9:$AU$160,2,0),\"\")","v":"Jump ½ turn "},null,null,null,{"$f":"IF(ISNUMBER(SEARCH($B$14,BC10)),MAX($BB$8:BB9)+1,0)","v":2},"Jump ½ turn ",null,null,{"$f":"IFERROR(VLOOKUP(ROWS($BC$9:BC10),$BB$9:$BC$160,2,0),\"\")","v":"Jump ½ turn "},null,null,null,{"$f":"IF(ISNUMBER(SEARCH($B$15,BK10)),MAX($BJ$8:BJ9)+1,0)","v":2},"Jump ½ turn ",null,null,{"$f":"IFERROR(VLOOKUP(ROWS($BK$9:BK10),$BJ$9:$BK$160,2,0),\"\")","v":"Jump ½ turn "},null,null,null,{"$f":"IF(ISNUMBER(SEARCH($B$16,BS10)),MAX($BR$8:BR9)+1,0)","v":2},"Jump ½ turn ",null,null,{"$f":"IFERROR(VLOOKUP(ROWS($BS$9:BS10),$BR$9:$BS$160,2,0),\"\")","v":"Jump ½ turn "},null,null,null,{"$f":"IF(ISNUMBER(SEARCH($B$17,CA10)),MAX($BZ$8:BZ9)+1,0)","v":2},"Jump ½ turn ",null,null,{"$f":"IFERROR(VLOOKUP(ROWS($CA$9:CA10),$BZ$9:$CA$160,2,0),\"\")","v":"Jump ½ turn "},null,null,null,{"$f":"IF(ISNUMBER(SEARCH($B$18,CI10)),MAX($CH$8:CH9)+1,0)","v":2},"Jump ½ turn ",null,null,{"$f":"IFERROR(VLOOKUP(ROWS($CI$9:CI10),$CH$9:$CI$160,2,0),\"\")","v":"Jump ½ turn "},null,null,null,{"$f":"IF($D$5=$J$33,IF(J10=$J$38,IF(F10=\"X\",\"Yes\",\"No\"),\"\"),\"\")","v":""},{"$f":"IF(J10=$J$37,IF(G10=\"X\",\"Yes\",\"No\"),\"\")","v":""},{"$f":"IF(J10<>$J$42,\"\",IF(G10=\"X\",IF(VLOOKUP(B10,Moves!A2:D54,4,FALSE)<>\"SS\",\"No\",\"Yes\"),\"No\"))","v":""},{"$f":"IF(K10<>$K$32,\"\",IF(E10=\"X\",IF(F10=\"X\",\"Yes\",IF(G10=\"X\",\"Yes\",IF(H10=\"X\",\"Yes\",IF(I10=\"X\",\"Yes\",\"No\"))))))","v":""},{"$f":"IF(CS10<>\"Yes\",\"\",IF(F10=\"X\",1,IF(G10=\"X\",2,IF(H10=\"X\",3,IF(I10=\"X\",4,\"No\")))))","v":""},"Yes","",{"$f":"IF(E10=\"X\",IF(K10=\"Bonus - C Skill\",\"No\",\"Yes\"),\"\")","v":""},{"$f":"IF(F10=\"X\",IF(K10=\"Bonus - C Skill\",\"No\",\"Yes\"),\"\")","v":""},{"$f":"IF(G10=\"X\",IF(K10=\"Bonus - C Skill\",\"No\",\"Yes\"),\"\")","v":""},{"$f":"IF(H10=\"X\",IF(K10=\"Bonus - C Skill\",\"No\",\"Yes\"),\"\")","v":""},{"$f":"IF(I10=\"X\",IF(K10=\"Bonus - C Skill\",\"No\",\"Yes\"),\"\")","v":""}]
[3,null,null,{"$f":"IFERROR(IF(VLOOKUP(B11,Moves!$A$1:$D$53,2,FALSE)=\"A\",\"X\",\" \"),\"\")","v":""},{"$f":"IFERROR(IF(VLOOKUP(B11,Moves!$A$1:$D$53,2,FALSE)=\"B\",\"X\",\" \"),\"\")","v":""},{"$f":"IFERROR(IF(VLOOKUP(B11,Moves!$A$1:$D$53,3,FALSE)=1,\"X\",\" \"),\"\")","v":""},{"$f":"IFERROR(IF(VLOOKUP(B11,Moves!$A$1:$D$53,3,FALSE)=2,\"X\",\" \"),\"\")","v":""},{"$f":"IFERROR(IF(VLOOKUP(B11,Moves!$A$1:$D$53,3,FALSE)=3,\"X\",\" \"),\"\")","v":""},{"$f":"IFERROR(IF(VLOOKUP(B11,Moves!$A$1:$D$53,3,FALSE)=4,\"X\",\" \"),\"\")","v":""},null,null,null,null,{"$f":"IF(ISNUMBER(SEARCH($B$9,O11)),MAX($N$8:N10)+1,0)","v":3},"Star jump ",null,null,{"$f":"IFERROR(VLOOKUP(ROWS($O$9:O11),$N$9:$O$160,2,0),\"\")","v":"Star jump "},null,null,null,{"$f":"IF(ISNUMBER(SEARCH($B$10,W11)),MAX($V$8:V10)+1,0)","v":3},"Star jump ",null,null,{"$f":"IFERROR(VLOOKUP(ROWS($W$9:W11),$V$9:$W$160,2,0),\"\")","v":"Star jump "},null,null,null,{"$f":"IF(ISNUMBER(SEARCH($B$11,AE11)),MAX($AD$8:AD10)+1,0)","v":3},"Star jump ",null,null,{"$f":"IFERROR(VLOOKUP(ROWS($AE$9:AE11),$AD$9:$AE$160,2,0),\"\")","v":"Star jump "},null,null,null,{"$f":"IF(ISNUMBER(SEARCH($B$12,AM11)),MAX($AL$8:AL10)+1,0)","v":3},"Star jump ",null,null,{"$f":"IFERROR(VLOOKUP(ROWS($AM$9:AM11),$AL$9:$AM$160,2,0),\"\")","v":"Star jump "},null,null,null,{"$f":"IF(ISNUMBER(SEARCH($B$13,AU11)),MAX($AT$8:AT10)+1,0)","v":3},"Star jump ",null,null,{"$f":"IFERROR(VLOOKUP(ROWS($AU$9:AU11),$AT$9:$AU$160,2,0),\"\")","v":"Star jump "},null,null,null,{"$f":"IF(ISNUMBER(SEARCH($B$14,BC11)),MAX($BB$8:BB10)+1,0)","v":3},"Star jump ",null,null,{"$f":"IFERROR(VLOOKUP(ROWS($BC$9:BC11),$BB$9:$BC$160,2,0),\"\")","v":"Star jump "},null,null,null,{"$f":"IF(ISNUMBER(SEARCH($B$15,BK11)),MAX($BJ$8:BJ10)+1,0)","v":3},"Star jump ",null,null,{"$f":"IFERROR(VLOOKUP(ROWS($BK$9:BK11),$BJ$9:$BK$160,2,0),\"\")","v":"Star jump "},null,null,null,{"$f":"IF(ISNUMBER(SEARCH($B$16,BS11)),MAX($BR$8:BR10)+1,0)","v":3},"Star jump ",null,null,{"$f":"IFERROR(VLOOKUP(ROWS($BS$9:BS11),$BR$9:$BS$160,2,0),\"\")","v":"Star jump "},null,null,null,{"$f":"IF(ISNUMBER(SEARCH($B$17,CA11)),MAX($BZ$8:BZ10)+1,0)","v":3},"Star jump ",null,null,{"$f":"IFERROR(VLOOKUP(ROWS($CA$9:CA11),$BZ$9:$CA$160,2,0),\"\")","v":"Star jump "},null,null,null,{"$f":"IF(ISNUMBER(SEARCH($B$18,CI11)),MAX($CH$8:CH10)+1,0)","v":3},"Star jump ",null,null,{"$f":"IFERROR(VLOOKUP(ROWS($CI$9:CI11),$CH$9:$CI$160,2,0),\"\")","v":"Star jump "},null,null,null,"","",{"$f":"IF(J11<>$J$42,\"\",IF(G11=\"X\",IF(VLOOKUP(B11,Moves!A3:D55,4,FALSE)<>\"SS\",\"No\",\"Yes\"),\"No\"))","v":""},"","","Yes","","","","","",""]
[4,null,null,{"$f":"IFERROR(IF(VLOOKUP(B12,Moves!$A$1:$D$53,2,FALSE)=\"A\",\"X\",\" \"),\"\")","v":""},{"$f":"IFERROR(IF(VLOOKUP(B12,Moves!$A$1:$D$53,2,FALSE)=\"B\",\"X\",\" \"),\"\")","v":""},{"$f":"IFERROR(IF(VLOOKUP(B12,Moves!$A$1:$D$53,3,FALSE)=1,\"X\",\" \"),\"\")","v":""},{"$f":"IFERROR(IF(VLOOKUP(B12,Moves!$A$1:$D$53,3,FALSE)=2,\"X\",\" \"),\"\")","v":""},{"$f":"IFERROR(IF(VLOOKUP(B12,Moves!$A$1:$D$53,3,FALSE)=3,\"X\",\" \"),\"\")","v":""},{"$f":"IFERROR(IF(VLOOKUP(B12,Moves!$A$1:$D$53,3,FALSE)=4,\"X\",\" \"),\"\")","v":""},null,null,null,null,{"$f":"IF(ISNUMBER(SEARCH($B$9,O12)),MAX($N$8:N11)+1,0)","v":4},"Tuck jump",null,null,{"$f":"IFERROR(VLOOKUP(ROWS($O$9:O12),$N$9:$O$160,2,0),\"\")","v":"Tuck jump"},null,null,null,{"$f":"IF(ISNUMBER(SEARCH($B$10,W12)),MAX($V$8:V11)+1,0)","v":4},"Tuck jump",null,null,{"$f":"IFERROR(VLOOKUP(ROWS($W$9:W12),$V$9:$W$160,2,0),\"\")","v":"Tuck jump"},null,null,null,{"$f":"IF(ISNUMBER(SEARCH($B$11,AE12)),MAX($AD$8:AD11)+1,0)","v":4},"Tuck jump",null,null,{"$f":"IFERROR(VLOOKUP(ROWS($AE$9:AE12),$AD$9:$AE$160,2,0),\"\")","v":"Tuck jump"},null,null,null,{"$f":"IF(ISNUMBER(SEARCH($B$12,AM12)),MAX($AL$8:AL11)+1,0)","v":4},"Tuck jump",null,null,{"$f":"IFERROR(VLOOKUP(ROWS($AM$9:AM12),$AL$9:$AM$160,2,0),\"\")","v":"Tuck jump"},null,null,null,{"$f":"IF(ISNUMBER(SEARCH($B$13,AU12)),MAX($AT$8:AT11)+1,0)","v":4},"Tuck jump",null,null,{"$f":"IFERROR(VLOOKUP(ROWS($AU$9:AU12),$AT$9:$AU$160,2,0),\"\")","v":"Tuck jump"},null,null,null,{"$f":"IF(ISNUMBER(SEARCH($B$14,BC12)),MAX($BB$8:BB11)+1,0)","v":4},"Tuck jump",null,null,{"$f":"IFERROR(VLOOKUP(ROWS($BC$9:BC12),$BB$9:$BC$160,2,0),\"\")","v":"Tuck jump"},null,null,null,{"$f":"IF(ISNUMBER(SEARCH($B$15,BK12)),MAX($BJ$8:BJ11)+1,0)","v":4},"Tuck jump",null,null,{"$f":"IFERROR(VLOOKUP(ROWS($BK$9:BK12),$BJ$9:$BK$160,2,0),\"\")","v":"Tuck jump"},null,null,null,{"$f":"IF(ISNUMBER(SEARCH($B$16,BS12)),MAX($BR$8:BR11)+1,0)","v":4},"Tuck jump",null,null,{"$f":"IFERROR(VLOOKUP(ROWS($BS$9:BS12),$BR$9:$BS$160,2,0),\"\")","v":"Tuck jump"},null,null,null,{"$f":"IF(ISNUMBER(SEARCH($B$17,CA12)),MAX($BZ$8:BZ11)+1,0)","v":4},"Tuck jump",null,null,{"$f":"IFERROR(VLOOKUP(ROWS($CA$9:CA12),$BZ$9:$CA$160,2,0),\"\")","v":"Tuck jump"},null,null,null,{"$f":"IF(ISNUMBER(SEARCH($B$18,CI12)),MAX($CH$8:CH11)+1,0)","v":4},"Tuck jump",null,null,{"$f":"IFERROR(VLOOKUP(ROWS($CI$9:CI12),$CH$9:$CI$160,2,0),\"\")","v":"Tuck jump"},null,null,null,"","",{"$f":"IF(J12<>$J$42,\"\",IF(G12=\"X\",IF(VLOOKUP(B12,Moves!A4:D56,4,FALSE)<>\"SS\",\"No\",\"Yes\"),\"No\"))","v":""},"","","Yes","","","","","",""]
[5,null,null,{"$f":"IFERROR(IF(VLOOKUP(B13,Moves!$A$1:$D$53,2,FALSE)=\"A\",\"X\",\" \"),\"\")","v":""},{"$f":"IFERROR(IF(VLOOKUP(B13,Moves!$A$1:$D$53,2,FALSE)=\"B\",\"X\",\" \"),\"\")","v":""},{"$f":"IFERROR(IF(VLOOKUP(B13,Moves!$A$1:$D$53,3,FALSE)=1,\"X\",\" \"),\"\")","v":""},{"$f":"IFERROR(IF(VLOOKUP(B13,Moves!$A$1:$D$53,3,FALSE)=2,\"X\",\" \"),\"\")","v":""},{"$f":"IFERROR(IF(VLOOKUP(B13,Moves!$A$1:$D$53,3,FALSE)=3,\"X\",\" \"),\"\")","v":""},{"$f":"IFERROR(IF(VLOOKUP(B13,Moves!$A$1:$D$53,3,FALSE)=4,\"X\",\" \"),\"\")","v":""},null,null,null,null,{"$f":"IF(ISNUMBER(SEARCH($B$9,O13)),MAX($N$8:N12)+1,0)","v":5},"2 x dynamic 1/2 turns on knees",null,null,{"$f":"IFERROR(VLOOKUP(ROWS($O$9:O13),$N$9:$O$160,2,0),\"\")","v":"2 x dynamic 1/2 turns on knees"},null,null,null,{"$f":"IF(ISNUMBER(SEARCH($B$10,W13)),MAX($V$8:V12)+1,0)","v":5},"2 x dynamic 1/2 turns on knees",null,null,{"$f":"IFERROR(VLOOKUP(ROWS($W$9:W13),$V$9:$W$160,2,0),\"\")","v":"2 x dynamic 1/2 turns on knees"},null,null,null,{"$f":"IF(ISNUMBER(SEARCH($B$11,AE13)),MAX($AD$8:AD12)+1,0)","v":5},"2 x dynamic 1/2 turns on knees",null,null,{"$f":"IFERROR(VLOOKUP(ROWS($AE$9:AE13),$AD$9:$AE$160,2,0),\"\")","v":"2 x dynamic 1/2 turns on knees"},null,null,null,{"$f":"IF(ISNUMBER(SEARCH($B$12,AM13)),MAX($AL$8:AL12)+1,0)","v":5},"2 x dynamic 1/2 turns on knees",null,null,{"$f":"IFERROR(VLOOKUP(ROWS($AM$9:AM13),$AL$9:$AM$160,2,0),\"\")","v":"2 x dynamic 1/2 turns on knees"},null,null,null,{"$f":"IF(ISNUMBER(SEARCH($B$13,AU13)),MAX($AT$8:AT12)+1,0)","v":5},"2 x dynamic 1/2 turns on knees",null,null,{"$f":"IFERROR(VLOOKUP(ROWS($AU$9:AU13),$AT$9:$AU$160,2,0),\"\")","v":"2 x dynamic 1/2 turns on knees"},null,null,null,{"$f":"IF(ISNUMBER(SEARCH($B$14,BC13)),MAX($BB$8:BB12)+1,0)","v":5},"2 x dynamic 1/2 turns on knees",null,null,{"$f":"IFERROR(VLOOKUP(ROWS($BC$9:BC13),$BB$9:$BC$160,2,0),\"\")","v":"2 x dynamic 1/2 turns on knees"},null,null,null,{"$f":"IF(ISNUMBER(SEARCH($B$15,BK13)),MAX($BJ$8:BJ12)+1,0)","v":5},"2 x dynamic 1/2 turns on knees",null,null,{"$f":"IFERROR(VLOOKUP(ROWS($BK$9:BK13),$BJ$9:$BK$160,2,0),\"\")","v":"2 x dynamic 1/2 turns on knees"},null,null,null,{"$f":"IF(ISNUMBER(SEARCH($B$16,BS13)),MAX($BR$8:BR12)+1,0)","v":5},"2 x dynamic 1/2 turns on knees",null,null,{"$f":"IFERROR(VLOOKUP(ROWS($BS$9:BS13),$BR$9:$BS$160,2,0),\"\")","v":"2 x dynamic 1/2 turns on knees"},null,null,null,{"$f":"IF(ISNUMBER(SEARCH($B$17,CA13)),MAX($BZ$8:BZ12)+1,0)","v":5},"2 x dynamic 1/2 turns on knees",null,null,{"$f":"IFERROR(VLOOKUP(ROWS($CA$9:CA13),$BZ$9:$CA$160,2,0),\"\")","v":"2 x dynamic 1/2 turns on knees"},null,null,null,{"$f":"IF(ISNUMBER(SEARCH($B$18,CI13)),MAX($CH$8:CH12)+1,0)","v":5},"2 x dynamic 1/2 turns on knees",null,null,{"$f":"IFERROR(VLOOKUP(ROWS($CI$9:CI13),$CH$9:$CI$160,2,0),\"\")","v":"2 x dynamic 1/2 turns on knees"},null,null,null,"","",{"$f":"IF(J13<>$J$42,\"\",IF(G13=\"X\",IF(VLOOKUP(B13,Moves!A5:D57,4,FALSE)<>\"SS\",\"No\",\"Yes\"),\"No\"))","v":""},"","","Yes","","","","","",""]
[6,null,null,{"$f":"IFERROR(IF(VLOOKUP(B14,Moves!$A$1:$D$53,2,FALSE)=\"A\",\"X\",\" \"),\"\")","v":""},{"$f":"IFERROR(IF(VLOOKUP(B14,Moves!$A$1:$D$53,2,FALSE)=\"B\",\"X\",\" \"),\"\")","v":""},{"$f":"IFERROR(IF(VLOOKUP(B14,Moves!$A$1:$D$53,3,FALSE)=1,\"X\",\" \"),\"\")","v":""},{"$f":"IFERROR(IF(VLOOKUP(B14,Moves!$A$1:$D$53,3,FALSE)=2,\"X\",\" \"),\"\")","v":""},{"$f":"IFERROR(IF(VLOOKUP(B14,Moves!$A$1:$D$53,3,FALSE)=3,\"X\",\" \"),\"\")","v":""},{"$f":"IFERROR(IF(VLOOKUP(B14,Moves!$A$1:$D$53,3,FALSE)=4,\"X\",\" \"),\"\")","v":""},null,null,null,null,{"$f":"IF(ISNUMBER(SEARCH($B$9,O14)),MAX($N$8:N13)+1,0)","v":6},"1 leg balance ",null,null,{"$f":"IFERROR(VLOOKUP(ROWS($O$9:O14),$N$9:$O$160,2,0),\"\")","v":"1 leg balance "},null,null,null,{"$f":"IF(ISNUMBER(SEARCH($B$10,W14)),MAX($V$8:V13)+1,0)","v":6},"1 leg balance ",null,null,{"$f":"IFERROR(VLOOKUP(ROWS($W$9:W14),$V$9:$W$160,2,0),\"\")","v":"1 leg balance "},null,null,null,{"$f":"IF(ISNUMBER(SEARCH($B$11,AE14)),MAX($AD$8:AD13)+1,0)","v":6},"1 leg balance ",null,null,{"$f":"IFERROR(VLOOKUP(ROWS($AE$9:AE14),$AD$9:$AE$160,2,0),\"\")","v":"1 leg balance "},null,null,null,{"$f":"IF(ISNUMBER(SEARCH($B$12,AM14)),MAX($AL$8:AL13)+1,0)","v":6},"1 leg balance ",null,null,{"$f":"IFERROR(VLOOKUP(ROWS($AM$9:AM14),$AL$9:$AM$160,2,0),\"\")","v":"1 leg balance "},null,null,null,{"$f":"IF(ISNUMBER(SEARCH($B$13,AU14)),MAX($AT$8:AT13)+1,0)","v":6},"1 leg balance ",null,null,{"$f":"IFERROR(VLOOKUP(ROWS($AU$9:AU14),$AT$9:$AU$160,2,0),\"\")","v":"1 leg balance "},null,null,null,{"$f":"IF(ISNUMBER(SEARCH($B$14,BC14)),MAX($BB$8:BB13)+1,0)","v":6},"1 leg balance ",null,null,{"$f":"IFERROR(VLOOKUP(ROWS($BC$9:BC14),$BB$9:$BC$160,2,0),\"\")","v":"1 leg balance "},null,null,null,{"$f":"IF(ISNUMBER(SEARCH($B$15,BK14)),MAX($BJ$8:BJ13)+1,0)","v":6},"1 leg balance ",null,null,{"$f":"IFERROR(VLOOKUP(ROWS($BK$9:BK14),$BJ$9:$BK$160,2,0),\"\")","v":"1 leg balance "},null,null,null,{"$f":"IF(ISNUMBER(SEARCH($B$16,BS14)),MAX($BR$8:BR13)+1,0)","v":6},"1 leg balance ",null,null,{"$f":"IFERROR(VLOOKUP(ROWS($BS$9:BS14),$BR$9:$BS$160,2,0),\"\")","v":"1 leg balance "},null,null,null,{"$f":"IF(ISNUMBER(SEARCH($B$17,CA14)),MAX($BZ$8:BZ13)+1,0)","v":6},"1 leg balance ",null,null,{"$f":"IFERROR(VLOOKUP(ROWS($CA$9:CA14),$BZ$9:$CA$160,2,0),\"\")","v":"1 leg balance "},null,null,null,{"$f":"IF(ISNUMBER(SEARCH($B$18,CI14)),MAX($CH$8:CH13)+1,0)","v":6},"1 leg balance ",null,null,{"$f":"IFERROR(VLOOKUP(ROWS($CI$9:CI14),$CH$9:$CI$160,2,0),\"\")","v":"1 leg balance "},null,null,null,"","",{"$f":"IF(J14<>$J$42,\"\",IF(G14=\"X\",IF(VLOOKUP(B14,Moves!A6:D58,4,FALSE)<>\"SS\",\"No\",\"Yes\"),\"No\"))","v":""},"","","Yes","","","","","",""]
[7,null,null,{"$f":"IFERROR(IF(VLOOKUP(B15,Moves!$A$1:$D$53,2,FALSE)=\"A\",\"X\",\" \"),\"\")","v":""},{"$f":"IFERROR(IF(VLOOKUP(B15,Moves!$A$1:$D$53,2,FALSE)=\"B\",\"X\",\" \"),\"\")","v":""},{"$f":"IFERROR(IF(VLOOKUP(B15,Moves!$A$1:$D$53,3,FALSE)=1,\"X\",\" \"),\"\")","v":""},{"$f":"IFERROR(IF(VLOOKUP(B15,Moves!$A$1:$D$53,3,FALSE)=2,\"X\",\" \"),\"\")","v":""},{"$f":"IFERROR(IF(VLOOKUP(B15,Moves!$A$1:$D$53,3,FALSE)=3,\"X\",\" \"),\"\")","v":""},{"$f":"IFERROR(IF(VLOOKUP(B15,Moves!$A$1:$D$53,3,FALSE)=4,\"X\",\" \"),\"\")","v":""},null,null,null,null,{"$f":"IF(ISNUMBER(SEARCH($B$9,O15)),MAX($N$8:N14)+1,0)","v":7},"Splits (F or S) ",null,null,{"$f":"IFERROR(VLOOKUP(ROWS($O$9:O15),$N$9:$O$160,2,0),\"\")","v":"Splits (F or S) "},null,null,null,{"$f":"IF(ISNUMBER(SEARCH($B$10,W15)),MAX($V$8:V14)+1,0)","v":7},"Splits (F or S) ",null,null,{"$f":"IFERROR(VLOOKUP(ROWS($W$9:W15),$V$9:$W$160,2,0),\"\")","v":"Splits (F or S) "},null,null,null,{"$f":"IF(ISNUMBER(SEARCH($B$11,AE15)),MAX($AD$8:AD14)+1,0)","v":7},"Splits (F or S) ",null,null,{"$f":"IFERROR(VLOOKUP(ROWS($AE$9:AE15),$AD$9:$AE$160,2,0),\"\")","v":"Splits (F or S) "},null,null,null,{"$f":"IF(ISNUMBER(SEARCH($B$12,AM15)),MAX($AL$8:AL14)+1,0)","v":7},"Splits (F or S) ",null,null,{"$f":"IFERROR(VLOOKUP(ROWS($AM$9:AM15),$AL$9:$AM$160,2,0),\"\")","v":"Splits (F or S) "},null,null,null,{"$f":"IF(ISNUMBER(SEARCH($B$13,AU15)),MAX($AT$8:AT14)+1,0)","v":7},"Splits (F or S) ",null,null,{"$f":"IFERROR(VLOOKUP(ROWS($AU$9:AU15),$AT$9:$AU$160,2,0),\"\")","v":"Splits (F or S) "},null,null,null,{"$f":"IF(ISNUMBER(SEARCH($B$14,BC15)),MAX($BB$8:BB14)+1,0)","v":7},"Splits (F or S) ",null,null,{"$f":"IFERROR(VLOOKUP(ROWS($BC$9:BC15),$BB$9:$BC$160,2,0),\"\")","v":"Splits (F or S) "},null,null,null,{"$f":"IF(ISNUMBER(SEARCH($B$15,BK15)),MAX($BJ$8:BJ14)+1,0)","v":7},"Splits (F or S) ",null,null,{"$f":"IFERROR(VLOOKUP(ROWS($BK$9:BK15),$BJ$9:$BK$160,2,0),\"\")","v":"Splits (F or S) "},null,null,null,{"$f":"IF(ISNUMBER(SEARCH($B$16,BS15)),MAX($BR$8:BR14)+1,0)","v":7},"Splits (F or S) ",null,null,{"$f":"IFERROR(VLOOKUP(ROWS($BS$9:BS15),$BR$9:$BS$160,2,0),\"\")","v":"Splits (F or S) "},null,null,null,{"$f":"IF(ISNUMBER(SEARCH($B$17,CA15)),MAX($BZ$8:BZ14)+1,0)","v":7},"Splits (F or S) ",null,null,{"$f":"IFERROR(VLOOKUP(ROWS($CA$9:CA15),$BZ$9:$CA$160,2,0),\"\")","v":"Splits (F or S) "},null,null,null,{"$f":"IF(ISNUMBER(SEARCH($B$18,CI15)),MAX($CH$8:CH14)+1,0)","v":7},"Splits (F or S) ",null,null,{"$f":"IFERROR(VLOOKUP(ROWS($CI$9:CI15),$CH$9:$CI$160,2,0),\"\")","v":"Splits (F or S) "},null,null,null,"","",{"$f":"IF(J15<>$J$42,\"\",IF(G15=\"X\",IF(VLOOKUP(B15,Moves!A7:D59,4,FALSE)<>\"SS\",\"No\",\"Yes\"),\"No\"))","v":""},"","","Yes","","","","","",""]
{"$rows_left_out":146}
{"sheet":"Moves","index":1,"n_rows":53,"n_cols":99,"rows_kept":53,"cut":false,"hidden":true,"merged":[]}
["Straight jump","A",1,"Leap/Hop"]
["Jump ½ turn ","A",1,"Leap/Hop"]
["Star jump ","A",1,"Leap/Hop"]
["Tuck jump","A",1,"Leap/Hop"]
["2 x dynamic 1/2 turns on knees","A",1,"Leap/Hop"]
["1 leg balance ","A",2]
["Splits (F or S) ","A",2]
["Japana (up to 45⁰ chest)","A",2]
["D Shape","A",2,null,null,null,null,null,null,null,null,null,null,null,null,null,null,null,null,null,null,null,null,null,null,null,null,null,null,null,null,null,null,null,null,null,null,null,null,null,null,null,null,null,null,null,null,null,null,null,null,null,null,null,null,null,null,null,null,null,null,null,null,null,null,null,null,null,null,null,null,null,null,null,null,null,null,null,null,null,null,null,null,null,null,null,null,null,null,null,null,null,null,null,null,null,null,null,{"$f":"IF(M9<>$M$39,\"\")","v":false}]
["Bridge","A",2]
["F or B support (lower or push up) ","A",2,"SS"]
["F Support turn to B Support","A",2,"SS"]
["Piked V sit (hand supp.)","A",2,"SS"]
["½ lever (1 foot on floor)","A",2]
["Headstand  (leg optional)","A",2,"SS"]
{"$rows_left_out":38}