{"text_format":"1","workbook":"xlsx","n_sheets":2,"sheets":["Template","Moves"],"not_rendered":{"charts":0,"images":0,"macros":1,"external_links":0,"defined_names":13,"comments":0,"pivot_tables":0},"unopened":[],"bounds":{"document_bytes":16777216,"sheet_cells":100000,"rows_first":2000,"rows_last":500,"rows_between":2000,"halvings":0,"cell_chars":16384,"cell_head_chars":4096},"cells_cut":0,"cells_raw":0,"read":"whole","date_system":"1900"}

{"sheet":"Template","index":0,"n_rows":163,"n_cols":109,"rows_kept":163,"cut":false,"hidden":false,"merged":[[27,0,27,1],[27,3,27,7],[27,8,27,11],[23,0,23,1],[23,3,23,7],[23,8,23,11],[34,8,34,11],[35,8,35,11],[34,3,34,7],[35,3,35,7],[29,0,29,1],[29,3,29,7],[29,8,29,12],[6,72,6,79],[6,80,6,87],[6,88,6,95],[6,24,6,31],[6,32,6,39],[6,40,6,47],[6,48,6,55],[6,56,6,63],[6,64,6,71],[6,16,6,23],[28,0,28,1],[28,3,28,7],[28,8,28,11],[24,0,24,1],[24,3,24,7],[24,8,24,11],[25,0,25,1],[25,3,25,7],[25,8,25,11],[22,0,22,1],[22,3,22,7],[22,8,22,11],[26,0,26,1],[26,3,26,7],[26,8,26,11],[20,0,20,1],[20,3,20,7],[20,8,20,11],[21,0,21,1],[21,3,21,7],[21,8,21,11],[4,5,4,9],[4,10,4,11],[19,0,19,1],[19,3,19,7],[19,8,19,11],[6,0,7,1],[6,3,6,7],[6,8,6,11],[18,3,18,7],[18,8,18,11],[4,0,4,1],[4,3,4,4],[5,0,5,1]]}
[]
[]
["Gold Intention Sheet"]
[]
["Gymnast Name:",null,"Gender:",null,null," Gymnast Number:",null,null,null,null,null,null,"Club:"]
[]
["ELEMENTS",null,"EXECUTION","DIFFICULTY",null,null,null,null,"GROUP",null,null,null,"SPECIAL REQUIREMENTS","BONUS",null,null,"Validation 1",null,null,null,null,null,null,null,"Validation 2",null,null,null,null,null,null,null,"Validation 3",null,null,null,null,null,null,null,"Validation 4",null,null,null,null,null,null,null,"Validation 5",null,null,null,null,null,null,null,"Validation 6",null,null,null,null,null,null,null,"Validation 7",null,null,null,null,null,null,null,"Validation 8",null,null,null,null,null,null,null,"Validation 9",null,null,null,null,null,null,null,"Validation 10",null,null,null,null,null,null,null,"LHS","G2","MS","MS G","AS","B1","B2","Crt met b4 B"]
[null,null,null,"A","B","C","D","E",1,2,3,4,null,null,null,null,"found","list",null,null,null,null,"count if","ofset","found","list",null,null,null,null,"count if","ofset","found","list",null,null,null,null,"count if","ofset","found","list",null,null,null,null,"count if","ofset","found","list",null,null,null,null,"count if","ofset","found","list",null,null,null,null,"count if","ofset","found","list",null,null,null,null,"count if","ofset","found","list",null,null,null,null,"count if","ofset","found","list",null,null,null,null,"count if","ofset","found","list",null,null,null,null,"count if","ofset",null,null,null,null,null,null,null,null,"B","C","D","E"]
[1,null,null,{"$f":"IFERROR(IF(VLOOKUP(B9,Moves!$A$1:$D$151,2,FALSE)=\"A\",\"X\",\" \"),\"\")","v":""},{"$f":"IFERROR(IF(VLOOKUP(B9,Moves!$A$1:$D$151,2,FALSE)=\"B\",\"X\",\" \"),\"\")","v":""},{"$f":"IFERROR(IF(VLOOKUP(B9,Moves!$A$1:$D$151,2,FALSE)=\"C\",\"X\",\" \"),\"\")","v":""},{"$f":"IFERROR(IF(VLOOKUP(B9,Moves!$A$1:$D$151,2,FALSE)=\"D\",\"X\",\" \"),\"\")","v":""},{"$f":"IFERROR(IF(VLOOKUP(B9,Moves!$A$1:$D$151,2,FALSE)=\"E\",\"X\",\" \"),\"\")","v":""},{"$f":"IFERROR(IF(VLOOKUP(B9,Moves!$A$1:$D$151,3,FALSE)=1,\"X\",\" \"),\"\")","v":""},{"$f":"IFERROR(IF(VLOOKUP(B9,Moves!$A$1:$D$151,3,FALSE)=2,\"X\",\" \"),\"\")","v":""},{"$f":"IFERROR(IF(VLOOKUP(B9,Moves!$A$1:$D$151,3,FALSE)=3,\"X\",\" \"),\"\")","v":""},{"$f":"IFERROR(IF(VLOOKUP(B9,Moves!$A$1:$D$151,3,FALSE)=4,\"X\",\" \"),\"\")","v":""},null,null,null,null,{"$f":"IF(ISNUMBER(SEARCH($B$9,R9)),MAX($Q$8:Q8)+1,0)","v":1},"Straight jump",null,null,{"$f":"IFERROR(VLOOKUP(ROWS($R$9:R9),$Q$9:$R$163,2,0),\"\")","v":"Straight jump"},null,{"$f":"COUNTIF(U9:U163,\"?*\")","v":155},{"$f":"OFFSET($U$9,,,COUNTIF($U$9:$U$163,\"?*\"))","v":"Straight jump"},{"$f":"IF(ISNUMBER(SEARCH($B$10,Z9)),MAX($Y$8:Y8)+1,0)","v":1},"Straight jump",null,null,{"$f":"IFERROR(VLOOKUP(ROWS($Z$9:Z9),$Y$9:$Z$163,2,0),\"\")","v":"Straight jump"},null,{"$f":"COUNTIF(AC9:AC163,\"?*\")","v":155},{"$f":"OFFSET($AC$9,,,COUNTIF($AC$9:$AC$163,\"?*\"))","v":"Straight jump"},{"$f":"IF(ISNUMBER(SEARCH($B$11,AH9)),MAX($AG$8:AG8)+1,0)","v":1},"Straight jump",null,null,{"$f":"IFERROR(VLOOKUP(ROWS($AH$9:AH9),$AG$9:$AH$163,2,0),\"\")","v":"Straight jump"},null,{"$f":"COUNTIF(AK9:AK163,\"?*\")","v":155},{"$f":"OFFSET($AK$9,,,COUNTIF($AK$9:$AK$163,\"?*\"))","v":"Straight jump"},{"$f":"IF(ISNUMBER(SEARCH($B$12,AP9)),MAX($AO$8:AO8)+1,0)","v":1},"Straight jump",null,null,{"$f":"IFERROR(VLOOKUP(ROWS($AP$9:AP9),$AO$9:$AP$163,2,0),\"\")","v":"Straight jump"},null,{"$f":"COUNTIF(AS9:AS163,\"?*\")","v":155},{"$f":"OFFSET($AS$9,,,COUNTIF($AS$9:$AS$163,\"?*\"))","v":"Straight jump"},{"$f":"IF(ISNUMBER(SEARCH($B$13,AX9)),MAX($AW$8:AW8)+1,0)","v":1},"Straight jump",null,null,{"$f":"IFERROR(VLOOKUP(ROWS($AX$9:AX9),$AW$9:$AX$163,2,0),\"\")","v":"Straight jump"},null,{"$f":"COUNTIF(BA9:BA163,\"?*\")","v":155},{"$f":"OFFSET($BA$9,,,COUNTIF($BA$9:$BA$163,\"?*\"))","v":"Straight jump"},{"$f":"IF(ISNUMBER(SEARCH($B$14,BF9)),MAX($BE$8:BE8)+1,0)","v":1},"Straight jump",null,null,{"$f":"IFERROR(VLOOKUP(ROWS($BF$9:BF9),$BE$9:$BF$163,2,0),\"\")","v":"Straight jump"},null,{"$f":"COUNTIF(BI9:BI163,\"?*\")","v":155},{"$f":"OFFSET($BI$9,,,COUNTIF($BI$9:$BI$163,\"?*\"))","v":"Straight jump"},{"$f":"IF(ISNUMBER(SEARCH($B$15,BN9)),MAX($BM$8:BM8)+1,0)","v":1},"Straight jump",null,null,{"$f":"IFERROR(VLOOKUP(ROWS($BN$9:BN9),$BM$9:$BN$163,2,0),\"\")","v":"Straight jump"},null,{"$f":"COUNTIF(BQ9:BQ163,\"?*\")","v":155},{"$f":"OFFSET($BQ$9,,,COUNTIF($BQ$9:$BQ$163,\"?*\"))","v":"Straight jump"},{"$f":"IF(ISNUMBER(SEARCH($B$16,BV9)),MAX($BU$8:BU8)+1,0)","v":1},"Straight jump",null,null,{"$f":"IFERROR(VLOOKUP(ROWS($BV$9:BV9),$BU$9:$BV$163,2,0),\"\")","v":"Straight jump"},null,{"$f":"COUNTIF(BY9:BY163,\"?*\")","v":155},{"$f":"OFFSET($BY$9,,,COUNTIF($BY$9:$BY$163,\"?*\"))","v":"Straight jump"},{"$f":"IF(ISNUMBER(SEARCH($B$17,CD9)),MAX($CC$8:CC8)+1,0)","v":1},"Straight jump",null,null,{"$f":"IFERROR(VLOOKUP(ROWS($CD$9:CD9),$CC$9:$CD$163,2,0),\"\")","v":"Straight jump"},null,{"$f":"COUNTIF(CG9:CG163,\"?*\")","v":155},{"$f":"OFFSET($CG$9,,,COUNTIF($CG$9:$CG$163,\"?*\"))","v":"Straight jump"},{"$f":"IF(ISNUMBER(SEARCH($B$18,CL9)),MAX($CK$8:CK8)+1,0)","v":1},"Straight jump",null,null,{"$f":"IFERROR(VLOOKUP(ROWS($CL$9:CL9),$CK$9:$CL$163,2,0),\"\")","v":"Straight jump"},null,{"$f":"COUNTIF(CO9:CO163,\"?*\")","v":155},{"$f":"OFFSET($CO$9,,,COUNTIF($CO$9:$CO$163,\"?*\"))","v":"Straight jump"},{"$f":"IF(M9<>$M$37,\"\",IF(I9=\"X\",IF(F9=\"X\",\"Yes\",IF(G9=\"X\",\"Yes\",IF(H9=\"X\",\"Yes\",\"No\")))))","v":""},{"$f":"IF(M9=$M$43,IF(J9=\"X\",IF(E9=\"X\",\"Yes\",IF(F9=\"X\",\"Yes\",IF(G9=\"X\",\"Yes\",IF(H9=\"X\",\"Yes\",\"No\"))))),IF(M9=$M$44,IF(J9=\"X\",IF(E9=\"X\",\"Yes\",IF(F9=\"X\",\"Yes\",IF(G9=\"X\",\"Yes\",IF(H9=\"X\",\"Yes\",\"No\"))))),\"\"))","v":""},{"$f":"IF(M9<>\"Mix series\",\"\",IF(I9=\"X\",IF(E9=\"X\",\"Yes\",IF(F9=\"X\",\"Yes\",IF(G9=\"X\",\"Yes\",IF(D9=\"X\",\"Yes\",IF(H9=\"X\",\"Yes\",\"No\"))))),IF(I9<>\"X\",IF(F9=\"X\",\"Yes\",IF(G9=\"X\",\"Yes\",IF(H9=\"X\",\"Yes\",\"No\"))))))","v":""},{"$f":"IF(CU9<>\"Yes\",\"\",IF(I9=\"X\",1,IF(J9=\"X\",2,IF(K9=\"X\",3,IF(L9=\"X\",4,\"No\")))))","v":""},{"$f":"IF(M9<>$M$39,\"\",IF(G9=\"X\",IF(VLOOKUP(B9,Moves!A1:D151,4,FALSE)=\"AFS2\",\"Yes\",\"No\"),IF(H9=\"X\",IF(VLOOKUP(B9,Moves!A1:D151,4,FALSE)=\"AFS2\",\"Yes\",\"No\"))))","v":""},{"$f":"IF(N9<>$N$33,\"\",IF(H9=\"X\",IF(I9<>\"X\",\"Yes\",\"No\"),\"No\"))","v":""},{"$f":"IF(N9<>$N$32,\"\",IF(H9<>\"X\",\"No\",IF(VLOOKUP(B9,Moves!$A$1:$D$151,4,FALSE)=\"AFS\",\"Yes\",IF(VLOOKUP(B9,Moves!$A$1:$D$151,4,FALSE)=\"AFS2\",\"Yes\",\"No\"))))","v":""},{"$f":"IF(COUNTIF(Q9:CW9,\"Yes\")=2,\"No\",\"Yes\")","v":"Yes"},{"$f":"IF(E9=\"X\",IF($N9=\"Bonus - E AFS\",\"No\",IF($N9=\"Bonus - Egrp 2,3 or 4\",\"No\",\"Yes\")),\"\")","v":""},{"$f":"IF(F9=\"X\",IF($N9=\"Bonus - E AFS\",\"No\",IF($N9=\"Bonus - Egrp 2,3 or 4\",\"No\",\"Yes\")),\"\")","v":""},{"$f":"IF(G9=\"X\",IF($N9=\"Bonus - E AFS\",\"No\",IF($N9=\"Bonus - Egrp 2,3 or 4\",\"No\",\"Yes\")),\"\")","v":""},{"$f":"IF(H9=\"X\",IF($N9=\"Bonus - E AFS\",\"No\",IF($N9=\"Bonus - E Grp 2,3 or 4\",\"No\",\"Yes\")),\"\")","v":""},{"$f":"IF(M9<>\"Mix series\",\"\",IF(I9=\"X\",\"Yes\",IF(I9<>\"X\",IF(COUNTIF(J9:L9,\"X\")=1,\"Yes\",\"No\"),\"No\")))","v":""}]
[2,null,null,{"$f":"IFERROR(IF(VLOOKUP(B10,Moves!$A$1:$D$151,2,FALSE)=\"A\",\"X\",\" \"),\"\")","v":""},{"$f":"IFERROR(IF(VLOOKUP(B10,Moves!$A$1:$D$151,2,FALSE)=\"B\",\"X\",\" \"),\"\")","v":""},{"$f":"IFERROR(IF(VLOOKUP(B10,Moves!$A$1:$D$151,2,FALSE)=\"C\",\"X\",\" \"),\"\")","v":""},{"$f":"IFERROR(IF(VLOOKUP(B10,Moves!$A$1:$D$151,2,FALSE)=\"D\",\"X\",\" \"),\"\")","v":""},{"$f":"IFERROR(IF(VLOOKUP(B10,Moves!$A$1:$D$151,2,FALSE)=\"E\",\"X\",\" \"),\"\")","v":""},{"$f":"IFERROR(IF(VLOOKUP(B10,Moves!$A$1:$D$151,3,FALSE)=1,\"X\",\" \"),\"\")","v":""},{"$f":"IFERROR(IF(VLOOKUP(B10,Moves!$A$1:$D$151,3,FALSE)=2,\"X\",\" \"),\"\")","v":""},{"$f":"IFERROR(IF(VLOOKUP(B10,Moves!$A$1:$D$151,3,FALSE)=3,\"X\",\" \"),\"\")","v":""},{"$f":"IFERROR(IF(VLOOKUP(B10,Moves!$A$1:$D$151,3,FALSE)=4,\"X\",\" \"),\"\")","v":""},null,null,null,null,{"$f":"IF(ISNUMBER(SEARCH($B$9,R10)),MAX($Q$8:Q9)+1,0)","v":2},"Jump ½ turn ",null,null,{"$f":"IFERROR(VLOOKUP(ROWS($R$9:R10),$Q$9:$R$163,2,0),\"\")","v":"Jump ½ turn "},null,null,null,{"$f":"IF(ISNUMBER(SEARCH($B$10,Z10)),MAX($Y$8:Y9)+1,0)","v":2},"Jump ½ turn ",null,null,{"$f":"IFERROR(VLOOKUP(ROWS($Z$9:Z10),$Y$9:$Z$163,2,0),\"\")","v":"Jump ½ turn "},null,null,null,{"$f":"IF(ISNUMBER(SEARCH($B$11,AH10)),MAX($AG$8:AG9)+1,0)","v":2},"Jump ½ turn ",null,null,{"$f":"IFERROR(VLOOKUP(ROWS($AH$9:AH10),$AG$9:$AH$163,2,0),\"\")","v":"Jump ½ turn "},null,null,null,{"$f":"IF(ISNUMBER(SEARCH($B$12,AP10)),MAX($AO$8:AO9)+1,0)","v":2},"Jump ½ turn ",null,null,{"$f":"IFERROR(VLOOKUP(ROWS($AP$9:AP10),$AO$9:$AP$163,2,0),\"\")","v":"Jump ½ turn "},null,null,null,{"$f":"IF(ISNUMBER(SEARCH($B$13,AX10)),MAX($AW$8:AW9)+1,0)","v":2},"Jump ½ turn ",null,null,{"$f":"IFERROR(VLOOKUP(ROWS($AX$9:AX10),$AW$9:$AX$163,2,0),\"\")","v":"Jump ½ turn "},null,null,null,{"$f":"IF(ISNUMBER(SEARCH($B$14,BF10)),MAX($BE$8:BE9)+1,0)","v":2},"Jump ½ turn ",null,null,{"$f":"IFERROR(VLOOKUP(ROWS($BF$9:BF10),$BE$9:$BF$163,2,0),\"\")","v":"Jump ½ turn "},null,null,null,{"$f":"IF(ISNUMBER(SEARCH($B$15,BN10)),MAX($BM$8:BM9)+1,0)","v":2},"Jump ½ turn ",null,null,{"$f":"IFERROR(VLOOKUP(ROWS($BN$9:BN10),$BM$9:$BN$163,2,0),\"\")","v":"Jump ½ turn "},null,null,null,{"$f":"IF(ISNUMBER(SEARCH($B$16,BV10)),MAX($BU$8:BU9)+1,0)","v":2},"Jump ½ turn ",null,null,{"$f":"IFERROR(VLOOKUP(ROWS($BV$9:BV10),$BU$9:$BV$163,2,0),\"\")","v":"Jump ½ turn "},null,null,null,{"$f":"IF(ISNUMBER(SEARCH($B$17,CD10)),MAX($CC$8:CC9)+1,0)","v":2},"Jump ½ turn ",null,null,{"$f":"IFERROR(VLOOKUP(ROWS($CD$9:CD10),$CC$9:$CD$163,2,0),\"\")","v":"Jump ½ turn "},null,null,null,{"$f":"IF(ISNUMBER(SEARCH($B$18,CL10)),MAX($CK$8:CK9)+1,0)","v":2},"Jump ½ turn ",null,null,{"$f":"IFERROR(VLOOKUP(ROWS($CL$9:CL10),$CK$9:$CL$163,2,0),\"\")","v":"Jump ½ turn "},null,null,null,"",{"$f":"IF(M10=$M$43,IF(J10=\"X\",IF(E10=\"X\",\"Yes\",IF(F10=\"X\",\"Yes\",IF(G10=\"X\",\"Yes\",IF(H10=\"X\",\"Yes\",\"No\"))))),IF(M10=$M$44,IF(J10=\"X\",IF(E10=\"X\",\"Yes\",IF(F10=\"X\",\"Yes\",IF(G10=\"X\",\"Yes\",IF(H10=\"X\",\"Yes\",\"No\"))))),\"\"))","v":""},{"$f":"IF(M10<>\"Mix series\",\"\",IF(I10=\"X\",IF(E10=\"X\",\"Yes\",IF(F10=\"X\",\"Yes\",IF(G10=\"X\",\"Yes\",IF(H10=\"X\",\"Yes\",\"No\")))),IF(I10<>\"X\",IF(F10=\"X\",\"Yes\",IF(G10=\"X\",\"Yes\",IF(H10=\"X\",\"Yes\",\"No\"))))))","v":""},{"$f":"IF(CU10<>\"Yes\",\"\",IF(I10=\"X\",1,IF(J10=\"X\",2,IF(K10=\"X\",3,IF(L10=\"X\",4,\"No\")))))","v":""},{"$f":"IF(M10<>$M$39,\"\",IF(G10=\"X\",IF(VLOOKUP(B10,Moves!A2:D152,4,FALSE)=\"AFS2\",\"Yes\",\"No\"),IF(H10=\"X\",IF(VLOOKUP(B10,Moves!A2:D152,4,FALSE)=\"AFS2\",\"Yes\",\"No\"))))","v":""},{"$f":"IF(N10<>$N$33,\"\",IF(H10=\"X\",IF(I10<>\"X\",\"Yes\",\"No\"),\"No\"))","v":""},{"$f":"IF(N10<>$N$32,\"\",IF(H10<>\"X\",\"No\",IF(VLOOKUP(B10,Moves!$A$1:$D$151,4,FALSE)=\"AFS\",\"Yes\",IF(VLOOKUP(B10,Moves!$A$1:$D$151,4,FALSE)=\"AFS2\",\"Yes\",\"No\"))))","v":""},{"$f":"IF(COUNTIF(Q10:CW10,\"Yes\")=2,\"No\",\"Yes\")","v":"Yes"},{"$f":"IF(E10=\"X\",IF($N10=\"Bonus - E AFS\",\"No\",IF($N10=\"Bonus - Egrp 2,3 or 4\",\"No\",\"Yes\")),\"\")","v":""},{"$f":"IF(F10=\"X\",IF($N10=\"Bonus - E AFS\",\"No\",IF($N10=\"Bonus - Egrp 2,3 or 4\",\"No\",\"Yes\")),\"\")","v":""},"",{"$f":"IF(H10=\"X\",IF($N10=\"Bonus - E AFS\",\"No\",IF($N10=\"Bonus - E Grp 2,3 or 4\",\"No\",\"Yes\")),\"\")","v":""},{"$f":"IF(M10<>\"Mix series\",\"\",IF(I10=\"X\",\"Yes\",IF(I10<>\"X\",IF(COUNTIF(J10:L10,\"X\")=1,\"Yes\",\"No\"),\"No\")))","v":""}]
{"$rows_left_out":154}
{"sheet":"Moves","index":1,"n_rows":155,"n_cols":99,"rows_kept":155,"cut":false,"hidden":true,"merged":[]}
["Straight jump","A",1,"Leap/Hop"]
["Jump ½ turn ","A",1,"Leap/Hop"]
["Star jump ","A",1,"Leap/Hop"]
["Tuck jump","A",1,"Leap/Hop"]
["2 x dynamic 1/2 turns on knees","A",1,"Leap/Hop"]
["1 leg balance ","A",2]
["Splits (F or S) ","A",2]
["Japana (up to 45⁰ chest)","A",2]
["D Shape","A",2,null,null,null,null,null,null,null,null,null,null,null,null,null,null,null,null,null,null,null,null,null,null,null,null,null,null,null,null,null,null,null,null,null,null,null,null,null,null,null,null,null,null,null,null,null,null,null,null,null,null,null,null,null,null,null,null,null,null,null,null,null,null,null,null,null,null,null,null,null,null,null,null,null,null,null,null,null,null,null,null,null,null,null,null,null,null,null,null,null,null,null,null,null,null,null,{"$f":"IF(M9<>$M$39,\"\")","v":false}]
["Bridge","A",2]
{"$rows_left_out":145}